UnstableConsole Output

Skipping 7,055 KB.. Full Log
[INFO] Using 'UTF-8' encoding to copy filtered resources.
[INFO] Using 'UTF-8' encoding to copy filtered properties files.
[INFO] Copying 16 resources
[INFO] 
[INFO] --- maven-resources-plugin:3.2.0:copy-resources (default) @ it-tidalwave-bluemarine2-rest ---
[INFO] Using 'UTF-8' encoding to copy filtered resources.
[INFO] Using 'UTF-8' encoding to copy filtered properties files.
[INFO] Copying 6 resources
[INFO] 
[INFO] --- maven-compiler-plugin:3.8.1:testCompile (default-testCompile) @ it-tidalwave-bluemarine2-rest ---
[INFO] Changes detected - recompiling the module!
[INFO] Compiling 1 source file to /var/jenkins_home/jobs/blueMarine2_Build_and_Quick_Test/workspace/modules/REST/target/unwoven-test-classes
[WARNING] No processor claimed any of these annotations: /org.testng.annotations.BeforeClass,/org.testng.annotations.Test,/org.testng.annotations.DataProvider,/javax.annotation.Nonnull
[INFO] 
[INFO] --- aspectj-maven-plugin:1.11:test-compile (weave-test-classes) @ it-tidalwave-bluemarine2-rest ---
[INFO] Showing AJC message detail for messages of types: [error, warning, fail]
[INFO] 
[INFO] --- maven-surefire-plugin:3.0.0-M5:test (default-test) @ it-tidalwave-bluemarine2-rest ---
[INFO] 
[INFO] -------------------------------------------------------
[INFO]  T E S T S
[INFO] -------------------------------------------------------
[INFO] Running it.tidalwave.bluemarine2.rest.impl.MusicResourcesControllerTest
19:11:27.995 [main                ] INFO  i.t.b.rest.impl.MusicResourcesControllerTest       - STARTING TESTS OF it.tidalwave.bluemarine2.rest.impl.MusicResourcesControllerTest
19:11:28.034 [main                ] INFO  i.t.bluemarine2.commons.test.SpringTestSupport     - Spring configuration locations: [classpath:META-INF/DciAutoBeans.xml, classpath:META-INF/CommonsAutoBeans.xml, classpath:META-INF/RestAutoBeans.xml, classpath:META-INF/CatalogAutoBeans.xml, classpath:META-INF/MusicResourceControllerTestBeans.xml]
19:11:31.597 [main                ] WARN  o.s.context.support.ClassPathXmlApplicationContext - Exception encountered during context initialization - cancelling refresh attempt: org.springframework.beans.factory.CannotLoadBeanClassException: Cannot find class [it.tidalwave.role.spring.spi.AnnotationSpringRoleManager] for bean with name 'roleManager' defined in class path resource [META-INF/DciAutoBeans.xml]; nested exception is java.lang.ClassNotFoundException: it.tidalwave.role.spring.spi.AnnotationSpringRoleManager
19:11:31.626 [main                ] ERROR i.t.b.rest.impl.MusicResourcesControllerTest       - CONFIGURATION FAILED org.springframework.beans.factory.CannotLoadBeanClassException: Cannot find class [it.tidalwave.role.spring.spi.AnnotationSpringRoleManager] for bean with name 'roleManager' defined in class path resource [META-INF/DciAutoBeans.xml]; nested exception is java.lang.ClassNotFoundException: it.tidalwave.role.spring.spi.AnnotationSpringRoleManager
19:11:31.631 [main                ] ERROR i.t.b.rest.impl.MusicResourcesControllerTest       - CONFIGURATION FAILED
org.springframework.beans.factory.CannotLoadBeanClassException: Cannot find class [it.tidalwave.role.spring.spi.AnnotationSpringRoleManager] for bean with name 'roleManager' defined in class path resource [META-INF/DciAutoBeans.xml]; nested exception is java.lang.ClassNotFoundException: it.tidalwave.role.spring.spi.AnnotationSpringRoleManager
	at org.springframework.beans.factory.support.AbstractBeanFactory.resolveBeanClass(AbstractBeanFactory.java:1537)
	at org.springframework.beans.factory.support.AbstractAutowireCapableBeanFactory.determineTargetType(AbstractAutowireCapableBeanFactory.java:693)
	at org.springframework.beans.factory.support.AbstractAutowireCapableBeanFactory.predictBeanType(AbstractAutowireCapableBeanFactory.java:663)
	at org.springframework.beans.factory.support.AbstractBeanFactory.isFactoryBean(AbstractBeanFactory.java:1665)
	at org.springframework.beans.factory.support.AbstractBeanFactory.isFactoryBean(AbstractBeanFactory.java:1142)
	at org.springframework.beans.factory.support.DefaultListableBeanFactory.preInstantiateSingletons(DefaultListableBeanFactory.java:924)
	at org.springframework.context.support.AbstractApplicationContext.finishBeanFactoryInitialization(AbstractApplicationContext.java:925)
	at org.springframework.context.support.AbstractApplicationContext.refresh(AbstractApplicationContext.java:588)
	at org.springframework.context.support.ClassPathXmlApplicationContext.<init>(ClassPathXmlApplicationContext.java:144)
	at org.springframework.context.support.ClassPathXmlApplicationContext.<init>(ClassPathXmlApplicationContext.java:95)
	at it.tidalwave.bluemarine2.commons.test.SpringTestSupport.createSpringContext(SpringTestSupport.java:109)
	at it.tidalwave.bluemarine2.commons.test.SpringTestSupport.beforeClass(SpringTestSupport.java:93)
	at java.base/jdk.internal.reflect.NativeMethodAccessorImpl.invoke0(Native Method)
	at java.base/jdk.internal.reflect.NativeMethodAccessorImpl.invoke(NativeMethodAccessorImpl.java:62)
	at java.base/jdk.internal.reflect.DelegatingMethodAccessorImpl.invoke(DelegatingMethodAccessorImpl.java:43)
	at java.base/java.lang.reflect.Method.invoke(Method.java:566)
	at org.testng.internal.MethodInvocationHelper.invokeMethod(MethodInvocationHelper.java:86)
	at org.testng.internal.Invoker.invokeConfigurationMethod(Invoker.java:514)
	at org.testng.internal.Invoker.invokeConfigurations(Invoker.java:215)
	at org.testng.internal.Invoker.invokeConfigurations(Invoker.java:142)
	at org.testng.internal.TestMethodWorker.invokeBeforeClassMethods(TestMethodWorker.java:178)
	at org.testng.internal.TestMethodWorker.run(TestMethodWorker.java:108)
	at org.testng.TestRunner.privateRun(TestRunner.java:782)
	at org.testng.TestRunner.run(TestRunner.java:632)
	at org.testng.SuiteRunner.runTest(SuiteRunner.java:366)
	at org.testng.SuiteRunner.runSequentially(SuiteRunner.java:361)
	at org.testng.SuiteRunner.privateRun(SuiteRunner.java:319)
	at org.testng.SuiteRunner.run(SuiteRunner.java:268)
	at org.testng.SuiteRunnerWorker.runSuite(SuiteRunnerWorker.java:52)
	at org.testng.SuiteRunnerWorker.run(SuiteRunnerWorker.java:86)
	at org.testng.TestNG.runSuitesSequentially(TestNG.java:1244)
	at org.testng.TestNG.runSuitesLocally(TestNG.java:1169)
	at org.testng.TestNG.run(TestNG.java:1064)
	at org.apache.maven.surefire.testng.TestNGExecutor.run(TestNGExecutor.java:136)
	at org.apache.maven.surefire.testng.TestNGDirectoryTestSuite.executeSingleClass(TestNGDirectoryTestSuite.java:112)
	at org.apache.maven.surefire.testng.TestNGDirectoryTestSuite.execute(TestNGDirectoryTestSuite.java:99)
	at org.apache.maven.surefire.testng.TestNGProvider.invoke(TestNGProvider.java:145)
	at org.apache.maven.surefire.booter.ForkedBooter.runSuitesInProcess(ForkedBooter.java:428)
	at org.apache.maven.surefire.booter.ForkedBooter.execute(ForkedBooter.java:162)
	at org.apache.maven.surefire.booter.ForkedBooter.run(ForkedBooter.java:562)
	at org.apache.maven.surefire.booter.ForkedBooter.main(ForkedBooter.java:548)
Caused by: java.lang.ClassNotFoundException: it.tidalwave.role.spring.spi.AnnotationSpringRoleManager
	at java.base/jdk.internal.loader.BuiltinClassLoader.loadClass(BuiltinClassLoader.java:581)
	at java.base/jdk.internal.loader.ClassLoaders$AppClassLoader.loadClass(ClassLoaders.java:178)
	at java.base/java.lang.ClassLoader.loadClass(ClassLoader.java:522)
	at java.base/java.lang.Class.forName0(Native Method)
	at java.base/java.lang.Class.forName(Class.java:398)
	at org.springframework.util.ClassUtils.forName(ClassUtils.java:284)
	at org.springframework.beans.factory.support.AbstractBeanDefinition.resolveBeanClass(AbstractBeanDefinition.java:469)
	at org.springframework.beans.factory.support.AbstractBeanFactory.doResolveBeanClass(AbstractBeanFactory.java:1602)
	at org.springframework.beans.factory.support.AbstractBeanFactory.resolveBeanClass(AbstractBeanFactory.java:1529)
	... 40 common frames omitted
19:11:31.653 [main                ] WARN  i.t.b.rest.impl.MusicResourcesControllerTest       - CONFIGURATION SKIPPED 
19:11:31.680 [main                ] WARN  i.t.b.rest.impl.MusicResourcesControllerTest       - CONFIGURATION SKIPPED 
19:11:31.690 [main                ] INFO  i.t.b.rest.impl.MusicResourcesControllerTest       - *******************************
19:11:31.690 [main                ] INFO  i.t.b.rest.impl.MusicResourcesControllerTest       - TEST "must serve REST resource"
19:11:31.690 [main                ] INFO  i.t.b.rest.impl.MusicResourcesControllerTest       - ARGS [dummy.txt, dummy.txt.txt]
19:11:31.690 [main                ] INFO  i.t.b.rest.impl.MusicResourcesControllerTest       - *******************************
19:11:31.694 [main                ] INFO  i.t.b.rest.impl.MusicResourcesControllerTest       - TEST SKIPPED 
19:11:31.695 [main                ] INFO  i.t.b.rest.impl.MusicResourcesControllerTest       - 
19:11:31.695 [main                ] WARN  i.t.b.rest.impl.MusicResourcesControllerTest       - CONFIGURATION SKIPPED 
19:11:31.696 [main                ] WARN  i.t.b.rest.impl.MusicResourcesControllerTest       - CONFIGURATION SKIPPED 
19:11:31.697 [main                ] INFO  i.t.b.rest.impl.MusicResourcesControllerTest       - ************************************
19:11:31.699 [main                ] INFO  i.t.b.rest.impl.MusicResourcesControllerTest       - TEST "must serve REST resource"
19:11:31.700 [main                ] INFO  i.t.b.rest.impl.MusicResourcesControllerTest       - ARGS [rest/record, records.json.txt]
19:11:31.700 [main                ] INFO  i.t.b.rest.impl.MusicResourcesControllerTest       - ************************************
19:11:31.709 [main                ] INFO  i.t.b.rest.impl.MusicResourcesControllerTest       - TEST SKIPPED 
19:11:31.709 [main                ] INFO  i.t.b.rest.impl.MusicResourcesControllerTest       - 
19:11:31.714 [main                ] WARN  i.t.b.rest.impl.MusicResourcesControllerTest       - CONFIGURATION SKIPPED 
19:11:31.716 [main                ] WARN  i.t.b.rest.impl.MusicResourcesControllerTest       - CONFIGURATION SKIPPED 
19:11:31.717 [main                ] INFO  i.t.b.rest.impl.MusicResourcesControllerTest       - *******************************************************************************************************************
19:11:31.717 [main                ] INFO  i.t.b.rest.impl.MusicResourcesControllerTest       - TEST "must serve REST resource"
19:11:31.719 [main                ] INFO  i.t.b.rest.impl.MusicResourcesControllerTest       - ARGS [rest/record/urn:bluemarine:record:eLWktOMBbcOWysVn6AW6kksBS7Q=, record-eLWktOMBbcOWysVn6AW6kksBS7Q=.json.txt]
19:11:31.719 [main                ] INFO  i.t.b.rest.impl.MusicResourcesControllerTest       - *******************************************************************************************************************
19:11:31.719 [main                ] INFO  i.t.b.rest.impl.MusicResourcesControllerTest       - TEST SKIPPED 
19:11:31.720 [main                ] INFO  i.t.b.rest.impl.MusicResourcesControllerTest       - 
19:11:31.720 [main                ] WARN  i.t.b.rest.impl.MusicResourcesControllerTest       - CONFIGURATION SKIPPED 
19:11:31.736 [main                ] WARN  i.t.b.rest.impl.MusicResourcesControllerTest       - CONFIGURATION SKIPPED 
19:11:31.738 [main                ] INFO  i.t.b.rest.impl.MusicResourcesControllerTest       - ***********************************************************************************
19:11:31.739 [main                ] INFO  i.t.b.rest.impl.MusicResourcesControllerTest       - TEST "must serve REST resource"
19:11:31.739 [main                ] INFO  i.t.b.rest.impl.MusicResourcesControllerTest       - ARGS [rest/record/urn:bluemarine:record:not_existing, record-not_existing.json.txt]
19:11:31.740 [main                ] INFO  i.t.b.rest.impl.MusicResourcesControllerTest       - ***********************************************************************************
19:11:31.742 [main                ] INFO  i.t.b.rest.impl.MusicResourcesControllerTest       - TEST SKIPPED 
19:11:31.742 [main                ] INFO  i.t.b.rest.impl.MusicResourcesControllerTest       - 
19:11:31.743 [main                ] WARN  i.t.b.rest.impl.MusicResourcesControllerTest       - CONFIGURATION SKIPPED 
19:11:31.744 [main                ] WARN  i.t.b.rest.impl.MusicResourcesControllerTest       - CONFIGURATION SKIPPED 
19:11:31.745 [main                ] INFO  i.t.b.rest.impl.MusicResourcesControllerTest       - ************************************************************************************************************************************
19:11:31.745 [main                ] INFO  i.t.b.rest.impl.MusicResourcesControllerTest       - TEST "must serve REST resource"
19:11:31.745 [main                ] INFO  i.t.b.rest.impl.MusicResourcesControllerTest       - ARGS [rest/record/urn:bluemarine:record:XoqvktWLs6mu64qGOxQ3NyPzXVY=/coverart, record-XoqvktWLs6mu64qGOxQ3NyPzXVY=-coverart.jpg.txt]
19:11:31.745 [main                ] INFO  i.t.b.rest.impl.MusicResourcesControllerTest       - ************************************************************************************************************************************
19:11:31.750 [main                ] INFO  i.t.b.rest.impl.MusicResourcesControllerTest       - TEST SKIPPED 
19:11:31.750 [main                ] INFO  i.t.b.rest.impl.MusicResourcesControllerTest       - 
19:11:31.750 [main                ] WARN  i.t.b.rest.impl.MusicResourcesControllerTest       - CONFIGURATION SKIPPED 
19:11:31.752 [main                ] WARN  i.t.b.rest.impl.MusicResourcesControllerTest       - CONFIGURATION SKIPPED 
19:11:31.753 [main                ] INFO  i.t.b.rest.impl.MusicResourcesControllerTest       - **********************************
19:11:31.754 [main                ] INFO  i.t.b.rest.impl.MusicResourcesControllerTest       - TEST "must serve REST resource"
19:11:31.754 [main                ] INFO  i.t.b.rest.impl.MusicResourcesControllerTest       - ARGS [rest/track, tracks.json.txt]
19:11:31.754 [main                ] INFO  i.t.b.rest.impl.MusicResourcesControllerTest       - **********************************
19:11:31.756 [main                ] INFO  i.t.b.rest.impl.MusicResourcesControllerTest       - TEST SKIPPED 
19:11:31.756 [main                ] INFO  i.t.b.rest.impl.MusicResourcesControllerTest       - 
19:11:31.756 [main                ] WARN  i.t.b.rest.impl.MusicResourcesControllerTest       - CONFIGURATION SKIPPED 
19:11:31.768 [main                ] WARN  i.t.b.rest.impl.MusicResourcesControllerTest       - CONFIGURATION SKIPPED 
19:11:31.770 [main                ] INFO  i.t.b.rest.impl.MusicResourcesControllerTest       - ****************************************************************************************************************
19:11:31.771 [main                ] INFO  i.t.b.rest.impl.MusicResourcesControllerTest       - TEST "must serve REST resource"
19:11:31.771 [main                ] INFO  i.t.b.rest.impl.MusicResourcesControllerTest       - ARGS [rest/track/urn:bluemarine:track:Q9KPhUq1xN6VJRpV5gWsDkRYHUc=, track-Q9KPhUq1xN6VJRpV5gWsDkRYHUc=.json.txt]
19:11:31.771 [main                ] INFO  i.t.b.rest.impl.MusicResourcesControllerTest       - ****************************************************************************************************************
19:11:31.776 [main                ] INFO  i.t.b.rest.impl.MusicResourcesControllerTest       - TEST SKIPPED 
19:11:31.782 [main                ] INFO  i.t.b.rest.impl.MusicResourcesControllerTest       - 
19:11:31.786 [main                ] WARN  i.t.b.rest.impl.MusicResourcesControllerTest       - CONFIGURATION SKIPPED 
19:11:31.786 [main                ] WARN  i.t.b.rest.impl.MusicResourcesControllerTest       - CONFIGURATION SKIPPED 
19:11:31.787 [main                ] INFO  i.t.b.rest.impl.MusicResourcesControllerTest       - ********************************************************************************
19:11:31.787 [main                ] INFO  i.t.b.rest.impl.MusicResourcesControllerTest       - TEST "must serve REST resource"
19:11:31.787 [main                ] INFO  i.t.b.rest.impl.MusicResourcesControllerTest       - ARGS [rest/track/urn:bluemarine:track:not_existing, track-not_existing.json.txt]
19:11:31.787 [main                ] INFO  i.t.b.rest.impl.MusicResourcesControllerTest       - ********************************************************************************
19:11:31.788 [main                ] INFO  i.t.b.rest.impl.MusicResourcesControllerTest       - TEST SKIPPED 
19:11:31.788 [main                ] INFO  i.t.b.rest.impl.MusicResourcesControllerTest       - 
19:11:31.790 [main                ] WARN  i.t.b.rest.impl.MusicResourcesControllerTest       - CONFIGURATION SKIPPED 
19:11:31.791 [main                ] WARN  i.t.b.rest.impl.MusicResourcesControllerTest       - CONFIGURATION SKIPPED 
19:11:31.792 [main                ] INFO  i.t.b.rest.impl.MusicResourcesControllerTest       - ******************************************
19:11:31.792 [main                ] INFO  i.t.b.rest.impl.MusicResourcesControllerTest       - TEST "must serve REST resource"
19:11:31.792 [main                ] INFO  i.t.b.rest.impl.MusicResourcesControllerTest       - ARGS [rest/audiofile, audiofiles.json.txt]
19:11:31.793 [main                ] INFO  i.t.b.rest.impl.MusicResourcesControllerTest       - ******************************************
19:11:31.795 [main                ] INFO  i.t.b.rest.impl.MusicResourcesControllerTest       - TEST SKIPPED 
19:11:31.795 [main                ] INFO  i.t.b.rest.impl.MusicResourcesControllerTest       - 
19:11:31.796 [main                ] WARN  i.t.b.rest.impl.MusicResourcesControllerTest       - CONFIGURATION SKIPPED 
19:11:31.798 [main                ] WARN  i.t.b.rest.impl.MusicResourcesControllerTest       - CONFIGURATION SKIPPED 
19:11:31.810 [main                ] INFO  i.t.b.rest.impl.MusicResourcesControllerTest       - ****************************************************************************************************************************
19:11:31.810 [main                ] INFO  i.t.b.rest.impl.MusicResourcesControllerTest       - TEST "must serve REST resource"
19:11:31.810 [main                ] INFO  i.t.b.rest.impl.MusicResourcesControllerTest       - ARGS [rest/audiofile/urn:bluemarine:audiofile:5lCKAUoE3IfmgttCE3a5U23gxQg=, audiofile-5lCKAUoE3IfmgttCE3a5U23gxQg=.json.txt]
19:11:31.810 [main                ] INFO  i.t.b.rest.impl.MusicResourcesControllerTest       - ****************************************************************************************************************************
19:11:31.811 [main                ] INFO  i.t.b.rest.impl.MusicResourcesControllerTest       - TEST SKIPPED 
19:11:31.811 [main                ] INFO  i.t.b.rest.impl.MusicResourcesControllerTest       - 
19:11:31.814 [main                ] WARN  i.t.b.rest.impl.MusicResourcesControllerTest       - CONFIGURATION SKIPPED 
19:11:31.822 [main                ] WARN  i.t.b.rest.impl.MusicResourcesControllerTest       - CONFIGURATION SKIPPED 
19:11:31.823 [main                ] INFO  i.t.b.rest.impl.MusicResourcesControllerTest       - ********************************************************************************************
19:11:31.823 [main                ] INFO  i.t.b.rest.impl.MusicResourcesControllerTest       - TEST "must serve REST resource"
19:11:31.823 [main                ] INFO  i.t.b.rest.impl.MusicResourcesControllerTest       - ARGS [rest/audiofile/urn:bluemarine:audiofile:not_existing, audiofile-not_existing.json.txt]
19:11:31.823 [main                ] INFO  i.t.b.rest.impl.MusicResourcesControllerTest       - ********************************************************************************************
19:11:31.824 [main                ] INFO  i.t.b.rest.impl.MusicResourcesControllerTest       - TEST SKIPPED 
19:11:31.824 [main                ] INFO  i.t.b.rest.impl.MusicResourcesControllerTest       - 
19:11:31.824 [main                ] WARN  i.t.b.rest.impl.MusicResourcesControllerTest       - CONFIGURATION SKIPPED 
19:11:31.825 [main                ] WARN  i.t.b.rest.impl.MusicResourcesControllerTest       - CONFIGURATION SKIPPED 
19:11:31.825 [main                ] INFO  i.t.b.rest.impl.MusicResourcesControllerTest       - *******************************************************************************************************************************************
19:11:31.825 [main                ] INFO  i.t.b.rest.impl.MusicResourcesControllerTest       - TEST "must serve REST resource"
19:11:31.825 [main                ] INFO  i.t.b.rest.impl.MusicResourcesControllerTest       - ARGS [rest/audiofile/urn:bluemarine:audiofile:Nmd7Bm3DQ922WhPkJn5YD_i_eK4=/content, audiofile-Nmd7Bm3DQ922WhPkJn5YD_i_eK4=-content.mp3.txt]
19:11:31.825 [main                ] INFO  i.t.b.rest.impl.MusicResourcesControllerTest       - *******************************************************************************************************************************************
19:11:31.826 [main                ] INFO  i.t.b.rest.impl.MusicResourcesControllerTest       - TEST SKIPPED 
19:11:31.826 [main                ] INFO  i.t.b.rest.impl.MusicResourcesControllerTest       - 
19:11:31.826 [main                ] WARN  i.t.b.rest.impl.MusicResourcesControllerTest       - CONFIGURATION SKIPPED 
19:11:31.827 [main                ] WARN  i.t.b.rest.impl.MusicResourcesControllerTest       - CONFIGURATION SKIPPED 
19:11:31.827 [main                ] INFO  i.t.b.rest.impl.MusicResourcesControllerTest       - *********************************************************************************************************************************************
19:11:31.827 [main                ] INFO  i.t.b.rest.impl.MusicResourcesControllerTest       - TEST "must serve REST resource"
19:11:31.827 [main                ] INFO  i.t.b.rest.impl.MusicResourcesControllerTest       - ARGS [rest/audiofile/urn:bluemarine:audiofile:Nmd7Bm3DQ922WhPkJn5YD_i_eK4=/coverart, audiofile-Nmd7Bm3DQ922WhPkJn5YD_i_eK4=-coverart.jpg.txt]
19:11:31.827 [main                ] INFO  i.t.b.rest.impl.MusicResourcesControllerTest       - *********************************************************************************************************************************************
19:11:31.828 [main                ] INFO  i.t.b.rest.impl.MusicResourcesControllerTest       - TEST SKIPPED 
19:11:31.828 [main                ] INFO  i.t.b.rest.impl.MusicResourcesControllerTest       - 
19:11:31.834 [main                ] WARN  i.t.b.rest.impl.MusicResourcesControllerTest       - CONFIGURATION SKIPPED 
19:11:31.835 [main                ] WARN  i.t.b.rest.impl.MusicResourcesControllerTest       - CONFIGURATION SKIPPED 
19:11:31.841 [main                ] INFO  i.t.b.rest.impl.MusicResourcesControllerTest       - *********************************************************************************************************************************************
19:11:31.841 [main                ] INFO  i.t.b.rest.impl.MusicResourcesControllerTest       - TEST "must serve REST resource"
19:11:31.841 [main                ] INFO  i.t.b.rest.impl.MusicResourcesControllerTest       - ARGS [rest/audiofile/urn:bluemarine:audiofile:5lCKAUoE3IfmgttCE3a5U23gxQg=/coverart, audiofile-5lCKAUoE3IfmgttCE3a5U23gxQg=-coverart.jpg.txt]
19:11:31.841 [main                ] INFO  i.t.b.rest.impl.MusicResourcesControllerTest       - *********************************************************************************************************************************************
19:11:31.842 [main                ] INFO  i.t.b.rest.impl.MusicResourcesControllerTest       - TEST SKIPPED 
19:11:31.842 [main                ] INFO  i.t.b.rest.impl.MusicResourcesControllerTest       - 
19:11:31.843 [main                ] WARN  i.t.b.rest.impl.MusicResourcesControllerTest       - CONFIGURATION SKIPPED 
19:11:31.844 [main                ] WARN  i.t.b.rest.impl.MusicResourcesControllerTest       - CONFIGURATION SKIPPED 
19:11:31.844 [main                ] INFO  i.t.b.rest.impl.MusicResourcesControllerTest       - ******************************
19:11:31.844 [main                ] INFO  i.t.b.rest.impl.MusicResourcesControllerTest       - TEST "test service publishing"
19:11:31.844 [main                ] INFO  i.t.b.rest.impl.MusicResourcesControllerTest       - ******************************
19:11:31.844 [main                ] INFO  i.t.b.rest.impl.MusicResourcesControllerTest       - TEST SKIPPED 
19:11:31.844 [main                ] INFO  i.t.b.rest.impl.MusicResourcesControllerTest       - 
19:11:31.845 [main                ] WARN  i.t.b.rest.impl.MusicResourcesControllerTest       - CONFIGURATION SKIPPED 
19:11:31.845 [main                ] WARN  i.t.b.rest.impl.MusicResourcesControllerTest       - CONFIGURATION SKIPPED 
19:11:31.981 [main                ] INFO  i.t.b.rest.impl.MusicResourcesControllerTest       - FINISHED TESTS OF it.tidalwave.bluemarine2.rest.impl.MusicResourcesControllerTest
[ERROR] Tests run: 48, Failures: 1, Errors: 0, Skipped: 47, Time elapsed: 5.687 s <<< FAILURE! - in it.tidalwave.bluemarine2.rest.impl.MusicResourcesControllerTest
[ERROR] it.tidalwave.bluemarine2.rest.impl.MusicResourcesControllerTest.beforeClass  Time elapsed: 4.994 s  <<< FAILURE!
org.springframework.beans.factory.CannotLoadBeanClassException: Cannot find class [it.tidalwave.role.spring.spi.AnnotationSpringRoleManager] for bean with name 'roleManager' defined in class path resource [META-INF/DciAutoBeans.xml]; nested exception is java.lang.ClassNotFoundException: it.tidalwave.role.spring.spi.AnnotationSpringRoleManager
Caused by: java.lang.ClassNotFoundException: it.tidalwave.role.spring.spi.AnnotationSpringRoleManager

[INFO] 
[INFO] Results:
[INFO] 
[ERROR] Failures: 
[ERROR]   MusicResourcesControllerTest>SpringTestSupport.beforeClass:93->SpringTestSupport.createSpringContext:109 » CannotLoadBeanClass
[INFO] 
[ERROR] Tests run: 20, Failures: 1, Errors: 0, Skipped: 19
[INFO] 
[ERROR] There are test failures.

Please refer to /var/jenkins_home/jobs/blueMarine2_Build_and_Quick_Test/workspace/modules/REST/target/surefire-reports/plain for the individual test results.
Please refer to dump files (if any exist) [date].dump, [date]-jvmRun[N].dump and [date].dumpstream.
[JENKINS] Recording test results
[INFO] 
[INFO] --- maven-jar-plugin:3.2.0:jar (default-jar) @ it-tidalwave-bluemarine2-rest ---
[INFO] Building jar: /var/jenkins_home/jobs/blueMarine2_Build_and_Quick_Test/workspace/modules/REST/target/it-tidalwave-bluemarine2-rest-1.1-ALPHA-2-SNAPSHOT.776aa35dcaa1.jar
[INFO] 
[INFO] --- maven-jar-plugin:3.2.0:test-jar (default-test-jar) @ it-tidalwave-bluemarine2-rest ---
[INFO] Building jar: /var/jenkins_home/jobs/blueMarine2_Build_and_Quick_Test/workspace/modules/REST/target/it-tidalwave-bluemarine2-rest-1.1-ALPHA-2-SNAPSHOT.776aa35dcaa1-tests.jar
[INFO] 
[INFO] --- maven-install-plugin:3.0.0-M1:install (default-install) @ it-tidalwave-bluemarine2-rest ---
[INFO] Installing /var/jenkins_home/jobs/blueMarine2_Build_and_Quick_Test/workspace/modules/REST/target/it-tidalwave-bluemarine2-rest-1.1-ALPHA-2-SNAPSHOT.776aa35dcaa1.jar to /var/jenkins_home/maven-repositories/0/it/tidalwave/bluemarine2/it-tidalwave-bluemarine2-rest/1.1-ALPHA-2-SNAPSHOT/it-tidalwave-bluemarine2-rest-1.1-ALPHA-2-SNAPSHOT.jar
[INFO] Installing /var/jenkins_home/jobs/blueMarine2_Build_and_Quick_Test/workspace/modules/REST/pom.xml to /var/jenkins_home/maven-repositories/0/it/tidalwave/bluemarine2/it-tidalwave-bluemarine2-rest/1.1-ALPHA-2-SNAPSHOT/it-tidalwave-bluemarine2-rest-1.1-ALPHA-2-SNAPSHOT.pom
[INFO] Installing /var/jenkins_home/jobs/blueMarine2_Build_and_Quick_Test/workspace/modules/REST/target/it-tidalwave-bluemarine2-rest-1.1-ALPHA-2-SNAPSHOT.776aa35dcaa1-tests.jar to /var/jenkins_home/maven-repositories/0/it/tidalwave/bluemarine2/it-tidalwave-bluemarine2-rest/1.1-ALPHA-2-SNAPSHOT/it-tidalwave-bluemarine2-rest-1.1-ALPHA-2-SNAPSHOT-tests.jar
[JENKINS] Archiving disabled
Started calculate disk usage of build
Finished Calculation of disk usage of build in 0 seconds
Started calculate disk usage of workspace
Finished Calculation of disk usage of workspace in 0 seconds
[INFO] 
[INFO] --< it.tidalwave.bluemarine2:it-tidalwave-bluemarine2-upnp-mediaserver >--
[INFO] Building blueMarine II :: Media Server :: UPnP 1.1-ALPHA-2-SNAPSHOT [20/26]
[INFO] --------------------------------[ jar ]---------------------------------
[INFO] Downloading from maven-proxy.tidalwave.it: https://services.tidalwave.it/nexus/content/groups/public/org/fourthline/cling/cling-support/2.1.1/cling-support-2.1.1.pom
[INFO] Downloaded from maven-proxy.tidalwave.it: https://services.tidalwave.it/nexus/content/groups/public/org/fourthline/cling/cling-support/2.1.1/cling-support-2.1.1.pom (4.9 kB at 1.3 kB/s)
[INFO] Downloading from maven-proxy.tidalwave.it: https://services.tidalwave.it/nexus/content/groups/public/org/fourthline/cling/cling/2.1.1/cling-2.1.1.pom
[INFO] Downloaded from maven-proxy.tidalwave.it: https://services.tidalwave.it/nexus/content/groups/public/org/fourthline/cling/cling/2.1.1/cling-2.1.1.pom (11 kB at 5.3 kB/s)
[INFO] Downloading from maven-proxy.tidalwave.it: https://services.tidalwave.it/nexus/content/groups/public/org/fourthline/cling/cling-core/2.1.1/cling-core-2.1.1.pom
[INFO] Downloaded from maven-proxy.tidalwave.it: https://services.tidalwave.it/nexus/content/groups/public/org/fourthline/cling/cling-core/2.1.1/cling-core-2.1.1.pom (8.8 kB at 4.3 kB/s)
[INFO] Downloading from maven-proxy.tidalwave.it: https://services.tidalwave.it/nexus/content/groups/public/org/seamless/seamless-util/1.1.1/seamless-util-1.1.1.pom
[INFO] Downloaded from maven-proxy.tidalwave.it: https://services.tidalwave.it/nexus/content/groups/public/org/seamless/seamless-util/1.1.1/seamless-util-1.1.1.pom (1.8 kB at 1.0 kB/s)
[INFO] Downloading from maven-proxy.tidalwave.it: https://services.tidalwave.it/nexus/content/groups/public/org/seamless/parent/1.1.1/parent-1.1.1.pom
[INFO] Downloaded from maven-proxy.tidalwave.it: https://services.tidalwave.it/nexus/content/groups/public/org/seamless/parent/1.1.1/parent-1.1.1.pom (9.3 kB at 4.9 kB/s)
[INFO] Downloading from maven-proxy.tidalwave.it: https://services.tidalwave.it/nexus/content/groups/public/org/seamless/seamless-http/1.1.1/seamless-http-1.1.1.pom
[INFO] Downloaded from maven-proxy.tidalwave.it: https://services.tidalwave.it/nexus/content/groups/public/org/seamless/seamless-http/1.1.1/seamless-http-1.1.1.pom (1.0 kB at 469 B/s)
[INFO] Downloading from maven-proxy.tidalwave.it: https://services.tidalwave.it/nexus/content/groups/public/org/seamless/seamless-xml/1.1.1/seamless-xml-1.1.1.pom
[INFO] Downloaded from maven-proxy.tidalwave.it: https://services.tidalwave.it/nexus/content/groups/public/org/seamless/seamless-xml/1.1.1/seamless-xml-1.1.1.pom (1.2 kB at 624 B/s)
[INFO] Downloading from maven-proxy.tidalwave.it: https://services.tidalwave.it/nexus/content/groups/public/org/seamless/seamless-swing/1.1.1/seamless-swing-1.1.1.pom
[INFO] Downloaded from maven-proxy.tidalwave.it: https://services.tidalwave.it/nexus/content/groups/public/org/seamless/seamless-swing/1.1.1/seamless-swing-1.1.1.pom (873 B at 395 B/s)
[INFO] Downloading from maven-proxy.tidalwave.it: https://services.tidalwave.it/nexus/content/groups/public/javax/enterprise/cdi-api/1.2/cdi-api-1.2.pom
[INFO] Downloaded from maven-proxy.tidalwave.it: https://services.tidalwave.it/nexus/content/groups/public/javax/enterprise/cdi-api/1.2/cdi-api-1.2.pom (6.3 kB at 21 kB/s)
[INFO] Downloading from maven-proxy.tidalwave.it: https://services.tidalwave.it/nexus/content/groups/public/org/jboss/weld/weld-parent/26/weld-parent-26.pom
[INFO] Downloaded from maven-proxy.tidalwave.it: https://services.tidalwave.it/nexus/content/groups/public/org/jboss/weld/weld-parent/26/weld-parent-26.pom (32 kB at 115 kB/s)
[INFO] Downloading from maven-proxy.tidalwave.it: https://services.tidalwave.it/nexus/content/groups/public/javax/el/javax.el-api/3.0.0/javax.el-api-3.0.0.pom
[INFO] Downloaded from maven-proxy.tidalwave.it: https://services.tidalwave.it/nexus/content/groups/public/javax/el/javax.el-api/3.0.0/javax.el-api-3.0.0.pom (11 kB at 40 kB/s)
[INFO] Downloading from maven-proxy.tidalwave.it: https://services.tidalwave.it/nexus/content/groups/public/javax/interceptor/javax.interceptor-api/1.2/javax.interceptor-api-1.2.pom
[INFO] Downloaded from maven-proxy.tidalwave.it: https://services.tidalwave.it/nexus/content/groups/public/javax/interceptor/javax.interceptor-api/1.2/javax.interceptor-api-1.2.pom (13 kB at 40 kB/s)
[INFO] Downloading from maven-proxy.tidalwave.it: https://services.tidalwave.it/nexus/content/groups/public/org/fourthline/cling/cling-support/2.1.1/cling-support-2.1.1.jar
[INFO] Downloading from maven-proxy.tidalwave.it: https://services.tidalwave.it/nexus/content/groups/public/org/fourthline/cling/cling-core/2.1.1/cling-core-2.1.1.jar
[INFO] Downloading from maven-proxy.tidalwave.it: https://services.tidalwave.it/nexus/content/groups/public/org/seamless/seamless-http/1.1.1/seamless-http-1.1.1.jar
[INFO] Downloading from maven-proxy.tidalwave.it: https://services.tidalwave.it/nexus/content/groups/public/org/seamless/seamless-util/1.1.1/seamless-util-1.1.1.jar
[INFO] Downloading from maven-proxy.tidalwave.it: https://services.tidalwave.it/nexus/content/groups/public/org/seamless/seamless-xml/1.1.1/seamless-xml-1.1.1.jar
[INFO] Downloaded from maven-proxy.tidalwave.it: https://services.tidalwave.it/nexus/content/groups/public/org/seamless/seamless-util/1.1.1/seamless-util-1.1.1.jar (94 kB at 44 kB/s)
[INFO] Downloading from maven-proxy.tidalwave.it: https://services.tidalwave.it/nexus/content/groups/public/org/seamless/seamless-swing/1.1.1/seamless-swing-1.1.1.jar
[INFO] Downloaded from maven-proxy.tidalwave.it: https://services.tidalwave.it/nexus/content/groups/public/org/seamless/seamless-http/1.1.1/seamless-http-1.1.1.jar (22 kB at 9.6 kB/s)
[INFO] Downloading from maven-proxy.tidalwave.it: https://services.tidalwave.it/nexus/content/groups/public/javax/enterprise/cdi-api/1.2/cdi-api-1.2.jar
[INFO] Downloaded from maven-proxy.tidalwave.it: https://services.tidalwave.it/nexus/content/groups/public/org/fourthline/cling/cling-support/2.1.1/cling-support-2.1.1.jar (500 kB at 204 kB/s)
[INFO] Downloading from maven-proxy.tidalwave.it: https://services.tidalwave.it/nexus/content/groups/public/javax/el/javax.el-api/3.0.0/javax.el-api-3.0.0.jar
[INFO] Downloaded from maven-proxy.tidalwave.it: https://services.tidalwave.it/nexus/content/groups/public/javax/enterprise/cdi-api/1.2/cdi-api-1.2.jar (71 kB at 28 kB/s)
[INFO] Downloading from maven-proxy.tidalwave.it: https://services.tidalwave.it/nexus/content/groups/public/javax/interceptor/javax.interceptor-api/1.2/javax.interceptor-api-1.2.jar
[INFO] Downloaded from maven-proxy.tidalwave.it: https://services.tidalwave.it/nexus/content/groups/public/javax/el/javax.el-api/3.0.0/javax.el-api-3.0.0.jar (73 kB at 27 kB/s)
[INFO] Downloaded from maven-proxy.tidalwave.it: https://services.tidalwave.it/nexus/content/groups/public/org/fourthline/cling/cling-core/2.1.1/cling-core-2.1.1.jar (665 kB at 240 kB/s)
[INFO] Downloaded from maven-proxy.tidalwave.it: https://services.tidalwave.it/nexus/content/groups/public/javax/interceptor/javax.interceptor-api/1.2/javax.interceptor-api-1.2.jar (24 kB at 8.6 kB/s)
[INFO] Downloaded from maven-proxy.tidalwave.it: https://services.tidalwave.it/nexus/content/groups/public/org/seamless/seamless-xml/1.1.1/seamless-xml-1.1.1.jar (63 kB at 22 kB/s)
[INFO] Downloaded from maven-proxy.tidalwave.it: https://services.tidalwave.it/nexus/content/groups/public/org/seamless/seamless-swing/1.1.1/seamless-swing-1.1.1.jar (72 kB at 18 kB/s)
[INFO] 
[INFO] --- maven-clean-plugin:3.1.0:clean (default-clean) @ it-tidalwave-bluemarine2-upnp-mediaserver ---
[INFO] 
[INFO] --- buildnumber-maven-plugin:1.4:create (default) @ it-tidalwave-bluemarine2-upnp-mediaserver ---
[INFO] ShortRevision tag detected. The value is '12'.
[INFO] Executing: /bin/sh -c cd '/var/jenkins_home/jobs/blueMarine2_Build_and_Quick_Test/workspace/modules/ClingMediaServer' && 'git' 'rev-parse' '--verify' '--short=12' 'HEAD'
[INFO] Working directory: /var/jenkins_home/jobs/blueMarine2_Build_and_Quick_Test/workspace/modules/ClingMediaServer
[INFO] Storing buildNumber: 776aa35dcaa1 at timestamp: 1674843117407
[WARNING] Cannot get the branch information from the git repository: 
Detecting the current branch failed: fatal: ref HEAD is not a symbolic ref

[INFO] ShortRevision tag detected. The value is '12'.
[INFO] Executing: /bin/sh -c cd '/var/jenkins_home/jobs/blueMarine2_Build_and_Quick_Test/workspace/modules/ClingMediaServer' && 'git' 'rev-parse' '--verify' '--short=12' 'HEAD'
[INFO] Working directory: /var/jenkins_home/jobs/blueMarine2_Build_and_Quick_Test/workspace/modules/ClingMediaServer
[INFO] Storing buildScmBranch: UNKNOWN
[INFO] 
[INFO] --- maven-enforcer-plugin:3.0.0-M3:enforce (enforce-maven) @ it-tidalwave-bluemarine2-upnp-mediaserver ---
[INFO] 
[INFO] --- maven-enforcer-plugin:3.0.0-M3:enforce (enforce-banned-dependencies) @ it-tidalwave-bluemarine2-upnp-mediaserver ---
[INFO] 
[INFO] --- maven-antrun-plugin:3.0.0:run (generate-and-print-build-description) @ it-tidalwave-bluemarine2-upnp-mediaserver ---
[INFO] Executing tasks
[INFO]      [echo] DESCRIPTION: origin/fabrizio.giudici 1.1-ALPHA-2-SNAPSHOT 776aa35dcaa1
[INFO]      [echo] Java Version: 11.0.10 -source 11 -target 11 -release 11
[INFO] Executed tasks
[INFO] 
[INFO] --- maven-antrun-plugin:3.0.0:run (create-unwoven-classes-dirs) @ it-tidalwave-bluemarine2-upnp-mediaserver ---
[INFO] Executing tasks
[INFO]     [mkdir] Created dir: /var/jenkins_home/jobs/blueMarine2_Build_and_Quick_Test/workspace/modules/ClingMediaServer/target/unwoven-classes
[INFO]     [mkdir] Created dir: /var/jenkins_home/jobs/blueMarine2_Build_and_Quick_Test/workspace/modules/ClingMediaServer/target/unwoven-test-classes
[INFO] Executed tasks
[INFO] 
[INFO] --- maven-resources-plugin:3.2.0:resources (default-resources) @ it-tidalwave-bluemarine2-upnp-mediaserver ---
[INFO] Using 'UTF-8' encoding to copy filtered resources.
[INFO] Using 'UTF-8' encoding to copy filtered properties files.
[INFO] Copying 2 resources
[INFO] The encoding used to copy filtered properties files have not been set. This means that the same encoding will be used to copy filtered properties files as when copying other filtered resources. This might not be what you want! Run your build with --debug to see which files might be affected. Read more at https://maven.apache.org/plugins/maven-resources-plugin/examples/filtering-properties-files.html
[INFO] 
[INFO] --- maven-compiler-plugin:3.8.1:compile (default-compile) @ it-tidalwave-bluemarine2-upnp-mediaserver ---
[INFO] Changes detected - recompiling the module!
[INFO] Compiling 18 source files to /var/jenkins_home/jobs/blueMarine2_Build_and_Quick_Test/workspace/modules/ClingMediaServer/target/unwoven-classes
[WARNING] No processor claimed any of these annotations: /org.fourthline.cling.binding.annotations.UpnpStateVariables,/javax.annotation.Nonnegative,/it.tidalwave.dci.annotation.DciRole,/javax.annotation.Nonnull,/javax.annotation.concurrent.Immutable,/javax.annotation.PostConstruct,java.base/java.lang.Override,/javax.inject.Inject,/org.fourthline.cling.binding.annotations.UpnpService,/javax.annotation.PreDestroy
[WARNING] /var/jenkins_home/jobs/blueMarine2_Build_and_Quick_Test/workspace/modules/ClingMediaServer/src/main/java/it/tidalwave/bluemarine2/upnp/mediaserver/impl/device/DefaultDevicePublisher.java:[76,12] [rawtypes] found raw type: LocalService
  missing type arguments for generic class LocalService<T>
  where T is a type-variable:
    T extends Object declared in class LocalService
[WARNING] /var/jenkins_home/jobs/blueMarine2_Build_and_Quick_Test/workspace/modules/ClingMediaServer/src/main/java/it/tidalwave/bluemarine2/upnp/mediaserver/impl/device/DefaultDevicePublisher.java:[173,29] [unchecked] unchecked method invocation: constructor <init> in class AutowireServiceManager is applied to given types
  required: AutowireCapableBeanFactory,LocalService<T>,Class<T>
  found: AutowireCapableBeanFactory,LocalService,Class<CAP#1>
  where T is a type-variable:
    T extends Object declared in class AutowireServiceManager
  where CAP#1 is a fresh type-variable:
    CAP#1 extends Object from capture of ?
[WARNING] /var/jenkins_home/jobs/blueMarine2_Build_and_Quick_Test/workspace/modules/ClingMediaServer/src/main/java/it/tidalwave/bluemarine2/upnp/mediaserver/impl/device/DefaultDevicePublisher.java:[173,71] [unchecked] unchecked conversion
  required: LocalService<T>
  found:    LocalService
  where T is a type-variable:
    T extends Object declared in class AutowireServiceManager
[WARNING] /var/jenkins_home/jobs/blueMarine2_Build_and_Quick_Test/workspace/modules/ClingMediaServer/src/main/java/it/tidalwave/bluemarine2/upnp/mediaserver/impl/device/DefaultDevicePublisher.java:[173,29] [unchecked] unchecked conversion
  required: DefaultServiceManager<T>
  found:    AutowireServiceManager
  where T is a type-variable:
    T extends Object declared in class DefaultDevicePublisher
[WARNING] /var/jenkins_home/jobs/blueMarine2_Build_and_Quick_Test/workspace/modules/ClingMediaServer/src/main/java/it/tidalwave/bluemarine2/upnp/mediaserver/impl/device/DefaultDevicePublisher.java:[174,30] [unchecked] unchecked call to setManager(ServiceManager<T>) as a member of the raw type LocalService
  where T is a type-variable:
    T extends Object declared in class LocalService
[WARNING] /var/jenkins_home/jobs/blueMarine2_Build_and_Quick_Test/workspace/modules/ClingMediaServer/src/main/java/it/tidalwave/bluemarine2/upnp/mediaserver/impl/didl/CompositeDIDLAdapterSupport.java:[80,86] [unchecked] unchecked conversion
  required: Finder<Entity>
  found:    Finder
[INFO] 
[INFO] --- aspectj-maven-plugin:1.11:compile (weave-classes) @ it-tidalwave-bluemarine2-upnp-mediaserver ---
[INFO] Showing AJC message detail for messages of types: [error, warning, fail]
[INFO] 
[INFO] --- maven-dependency-plugin:3.1.2:unpack (unpack-testset-triples) @ it-tidalwave-bluemarine2-upnp-mediaserver ---
[INFO] Configured Artifact: it.tidalwave.bluemarine2:it-tidalwave-bluemarine2-mediascanner:tests:?:jar
[INFO] Configured Artifact: it.tidalwave.bluemarine2:it-tidalwave-bluemarine2-metadata-musicbrainz:tests:?:jar
[INFO] Unpacking /var/jenkins_home/jobs/blueMarine2_Build_and_Quick_Test/workspace/modules/MediaScanner/target/it-tidalwave-bluemarine2-mediascanner-1.1-ALPHA-2-SNAPSHOT.776aa35dcaa1-tests.jar to /var/jenkins_home/jobs/blueMarine2_Build_and_Quick_Test/workspace/modules/ClingMediaServer/target/extra with includes "expected-results/**/*.n3" and excludes ""
[INFO] Unpacking /var/jenkins_home/jobs/blueMarine2_Build_and_Quick_Test/workspace/modules/MusicBrainz/target/it-tidalwave-bluemarine2-metadata-musicbrainz-1.1-ALPHA-2-SNAPSHOT.776aa35dcaa1-tests.jar to /var/jenkins_home/jobs/blueMarine2_Build_and_Quick_Test/workspace/modules/ClingMediaServer/target/extra with includes "expected-results/**/*.n3" and excludes ""
[INFO] 
[INFO] --- maven-resources-plugin:3.2.0:testResources (default-testResources) @ it-tidalwave-bluemarine2-upnp-mediaserver ---
[INFO] Using 'UTF-8' encoding to copy filtered resources.
[INFO] Using 'UTF-8' encoding to copy filtered properties files.
[INFO] Copying 207 resources
[INFO] 
[INFO] --- maven-resources-plugin:3.2.0:copy-resources (default) @ it-tidalwave-bluemarine2-upnp-mediaserver ---
[INFO] Using 'UTF-8' encoding to copy filtered resources.
[INFO] Using 'UTF-8' encoding to copy filtered properties files.
[INFO] Copying 6 resources
[INFO] 
[INFO] --- maven-compiler-plugin:3.8.1:testCompile (default-testCompile) @ it-tidalwave-bluemarine2-upnp-mediaserver ---
[INFO] Changes detected - recompiling the module!
[INFO] Compiling 6 source files to /var/jenkins_home/jobs/blueMarine2_Build_and_Quick_Test/workspace/modules/ClingMediaServer/target/unwoven-test-classes
[WARNING] No processor claimed any of these annotations: /org.testng.annotations.AfterClass,/org.fourthline.cling.binding.annotations.UpnpStateVariable,/org.fourthline.cling.binding.annotations.UpnpAction,/javax.annotation.Nonnull,/org.testng.annotations.BeforeClass,/org.testng.annotations.Test,/org.testng.annotations.DataProvider,java.base/java.lang.Override,/org.fourthline.cling.binding.annotations.UpnpService,/org.fourthline.cling.binding.annotations.UpnpInputArgument
[WARNING] /var/jenkins_home/jobs/blueMarine2_Build_and_Quick_Test/workspace/modules/ClingMediaServer/src/test/java/it/tidalwave/bluemarine2/upnp/mediaserver/impl/ClingContentDirectoryAdapterSystemIntegrationTest.java:[212,53] [rawtypes] found raw type: ActionInvocation
  missing type arguments for generic class ActionInvocation<S>
  where S is a type-variable:
    S extends Service declared in class ActionInvocation
[WARNING] /var/jenkins_home/jobs/blueMarine2_Build_and_Quick_Test/workspace/modules/ClingMediaServer/src/test/java/it/tidalwave/bluemarine2/upnp/mediaserver/impl/ClingContentDirectoryAdapterSystemIntegrationTest.java:[240,52] [rawtypes] found raw type: ActionInvocation
  missing type arguments for generic class ActionInvocation<S>
  where S is a type-variable:
    S extends Service declared in class ActionInvocation
[WARNING] /var/jenkins_home/jobs/blueMarine2_Build_and_Quick_Test/workspace/modules/ClingMediaServer/src/test/java/it/tidalwave/bluemarine2/upnp/mediaserver/impl/UpnpClient.java:[57,34] [rawtypes] found raw type: Service
  missing type arguments for generic class Service<D,S>
  where D,S are type-variables:
    D extends Device declared in class Service
    S extends Service declared in class Service
[WARNING] /var/jenkins_home/jobs/blueMarine2_Build_and_Quick_Test/workspace/modules/ClingMediaServer/src/test/java/it/tidalwave/bluemarine2/upnp/mediaserver/impl/UpnpClient.java:[86,11] [rawtypes] found raw type: Service
  missing type arguments for generic class Service<D,S>
  where D,S are type-variables:
    D extends Device declared in class Service
    S extends Service declared in class Service
[WARNING] /var/jenkins_home/jobs/blueMarine2_Build_and_Quick_Test/workspace/modules/ClingMediaServer/src/test/java/it/tidalwave/bluemarine2/upnp/mediaserver/impl/UpnpClient.java:[107,18] [rawtypes] found raw type: Service
  missing type arguments for generic class Service<D,S>
  where D,S are type-variables:
    D extends Device declared in class Service
    S extends Service declared in class Service
[WARNING] /var/jenkins_home/jobs/blueMarine2_Build_and_Quick_Test/workspace/modules/ClingMediaServer/src/test/java/it/tidalwave/bluemarine2/upnp/mediaserver/impl/UpnpClient.java:[145,18] [rawtypes] found raw type: Service
  missing type arguments for generic class Service<D,S>
  where D,S are type-variables:
    D extends Device declared in class Service
    S extends Service declared in class Service
[WARNING] /var/jenkins_home/jobs/blueMarine2_Build_and_Quick_Test/workspace/modules/ClingMediaServer/src/test/java/it/tidalwave/bluemarine2/upnp/mediaserver/impl/device/DefaultDevicePublisherTest.java:[54,80] [unchecked] unchecked conversion
  required: DefaultDevicePublisher<UPnPServerMock>
  found:    DefaultDevicePublisher
[INFO] 
[INFO] --- aspectj-maven-plugin:1.11:test-compile (weave-test-classes) @ it-tidalwave-bluemarine2-upnp-mediaserver ---
[INFO] Showing AJC message detail for messages of types: [error, warning, fail]
[INFO] 
[INFO] --- maven-surefire-plugin:3.0.0-M5:test (default-test) @ it-tidalwave-bluemarine2-upnp-mediaserver ---
[INFO] 
[INFO] -------------------------------------------------------
[INFO]  T E S T S
[INFO] -------------------------------------------------------
[INFO] Running TestSuite
19:12:18.542 [main                ] INFO  i.t.b.u.m.i.ClingContentDirectoryAdapterSystemIntegrationTest - STARTING TESTS OF it.tidalwave.bluemarine2.upnp.mediaserver.impl.ClingContentDirectoryAdapterSystemIntegrationTest
19:12:18.593 [main                ] INFO  i.t.bluemarine2.commons.test.SpringTestSupport     - Spring configuration locations: [META-INF/DciAutoBeans.xml, META-INF/CommonsAutoBeans.xml, META-INF/CatalogAutoBeans.xml, META-INF/MediaServerAutoBeans.xml, META-INF/RestAutoBeans.xml, META-INF/UPnPAutoBeans.xml, META-INF/UPnPTestBeans.xml]
19:12:21.227 [main                ] WARN  o.s.context.support.ClassPathXmlApplicationContext - Exception encountered during context initialization - cancelling refresh attempt: org.springframework.beans.factory.CannotLoadBeanClassException: Cannot find class [it.tidalwave.role.spring.spi.AnnotationSpringRoleManager] for bean with name 'roleManager' defined in class path resource [META-INF/DciAutoBeans.xml]; nested exception is java.lang.ClassNotFoundException: it.tidalwave.role.spring.spi.AnnotationSpringRoleManager
19:12:21.241 [main                ] ERROR i.t.b.u.m.i.ClingContentDirectoryAdapterSystemIntegrationTest - CONFIGURATION FAILED org.springframework.beans.factory.CannotLoadBeanClassException: Cannot find class [it.tidalwave.role.spring.spi.AnnotationSpringRoleManager] for bean with name 'roleManager' defined in class path resource [META-INF/DciAutoBeans.xml]; nested exception is java.lang.ClassNotFoundException: it.tidalwave.role.spring.spi.AnnotationSpringRoleManager
19:12:21.259 [main                ] ERROR i.t.b.u.m.i.ClingContentDirectoryAdapterSystemIntegrationTest - CONFIGURATION FAILED
org.springframework.beans.factory.CannotLoadBeanClassException: Cannot find class [it.tidalwave.role.spring.spi.AnnotationSpringRoleManager] for bean with name 'roleManager' defined in class path resource [META-INF/DciAutoBeans.xml]; nested exception is java.lang.ClassNotFoundException: it.tidalwave.role.spring.spi.AnnotationSpringRoleManager
	at org.springframework.beans.factory.support.AbstractBeanFactory.resolveBeanClass(AbstractBeanFactory.java:1537)
	at org.springframework.beans.factory.support.AbstractAutowireCapableBeanFactory.determineTargetType(AbstractAutowireCapableBeanFactory.java:693)
	at org.springframework.beans.factory.support.AbstractAutowireCapableBeanFactory.predictBeanType(AbstractAutowireCapableBeanFactory.java:663)
	at org.springframework.beans.factory.support.AbstractBeanFactory.isFactoryBean(AbstractBeanFactory.java:1665)
	at org.springframework.beans.factory.support.AbstractBeanFactory.isFactoryBean(AbstractBeanFactory.java:1142)
	at org.springframework.beans.factory.support.DefaultListableBeanFactory.preInstantiateSingletons(DefaultListableBeanFactory.java:924)
	at org.springframework.context.support.AbstractApplicationContext.finishBeanFactoryInitialization(AbstractApplicationContext.java:925)
	at org.springframework.context.support.AbstractApplicationContext.refresh(AbstractApplicationContext.java:588)
	at org.springframework.context.support.ClassPathXmlApplicationContext.<init>(ClassPathXmlApplicationContext.java:144)
	at org.springframework.context.support.ClassPathXmlApplicationContext.<init>(ClassPathXmlApplicationContext.java:95)
	at it.tidalwave.bluemarine2.commons.test.SpringTestSupport.createSpringContext(SpringTestSupport.java:109)
	at it.tidalwave.bluemarine2.commons.test.SpringTestSupport.beforeClass(SpringTestSupport.java:93)
	at java.base/jdk.internal.reflect.NativeMethodAccessorImpl.invoke0(Native Method)
	at java.base/jdk.internal.reflect.NativeMethodAccessorImpl.invoke(NativeMethodAccessorImpl.java:62)
	at java.base/jdk.internal.reflect.DelegatingMethodAccessorImpl.invoke(DelegatingMethodAccessorImpl.java:43)
	at java.base/java.lang.reflect.Method.invoke(Method.java:566)
	at org.testng.internal.MethodInvocationHelper.invokeMethod(MethodInvocationHelper.java:86)
	at org.testng.internal.Invoker.invokeConfigurationMethod(Invoker.java:514)
	at org.testng.internal.Invoker.invokeConfigurations(Invoker.java:215)
	at org.testng.internal.Invoker.invokeConfigurations(Invoker.java:142)
	at org.testng.internal.TestMethodWorker.invokeBeforeClassMethods(TestMethodWorker.java:178)
	at org.testng.internal.TestMethodWorker.run(TestMethodWorker.java:108)
	at org.testng.TestRunner.privateRun(TestRunner.java:782)
	at org.testng.TestRunner.run(TestRunner.java:632)
	at org.testng.SuiteRunner.runTest(SuiteRunner.java:366)
	at org.testng.SuiteRunner.runSequentially(SuiteRunner.java:361)
	at org.testng.SuiteRunner.privateRun(SuiteRunner.java:319)
	at org.testng.SuiteRunner.run(SuiteRunner.java:268)
	at org.testng.SuiteRunnerWorker.runSuite(SuiteRunnerWorker.java:52)
	at org.testng.SuiteRunnerWorker.run(SuiteRunnerWorker.java:86)
	at org.testng.TestNG.runSuitesSequentially(TestNG.java:1244)
	at org.testng.TestNG.runSuitesLocally(TestNG.java:1169)
	at org.testng.TestNG.run(TestNG.java:1064)
	at org.apache.maven.surefire.testng.TestNGExecutor.run(TestNGExecutor.java:136)
	at org.apache.maven.surefire.testng.TestNGDirectoryTestSuite.executeMulti(TestNGDirectoryTestSuite.java:193)
	at org.apache.maven.surefire.testng.TestNGDirectoryTestSuite.execute(TestNGDirectoryTestSuite.java:94)
	at org.apache.maven.surefire.testng.TestNGProvider.invoke(TestNGProvider.java:145)
	at org.apache.maven.surefire.booter.ForkedBooter.runSuitesInProcess(ForkedBooter.java:428)
	at org.apache.maven.surefire.booter.ForkedBooter.execute(ForkedBooter.java:162)
	at org.apache.maven.surefire.booter.ForkedBooter.run(ForkedBooter.java:562)
	at org.apache.maven.surefire.booter.ForkedBooter.main(ForkedBooter.java:548)
Caused by: java.lang.ClassNotFoundException: it.tidalwave.role.spring.spi.AnnotationSpringRoleManager
	at java.base/jdk.internal.loader.BuiltinClassLoader.loadClass(BuiltinClassLoader.java:581)
	at java.base/jdk.internal.loader.ClassLoaders$AppClassLoader.loadClass(ClassLoaders.java:178)
	at java.base/java.lang.ClassLoader.loadClass(ClassLoader.java:522)
	at java.base/java.lang.Class.forName0(Native Method)
	at java.base/java.lang.Class.forName(Class.java:398)
	at org.springframework.util.ClassUtils.forName(ClassUtils.java:284)
	at org.springframework.beans.factory.support.AbstractBeanDefinition.resolveBeanClass(AbstractBeanDefinition.java:469)
	at org.springframework.beans.factory.support.AbstractBeanFactory.doResolveBeanClass(AbstractBeanFactory.java:1602)
	at org.springframework.beans.factory.support.AbstractBeanFactory.resolveBeanClass(AbstractBeanFactory.java:1529)
	... 40 common frames omitted
19:12:21.268 [main                ] WARN  i.t.b.u.m.i.ClingContentDirectoryAdapterSystemIntegrationTest - CONFIGURATION SKIPPED 
19:12:21.268 [main                ] WARN  i.t.b.u.m.i.ClingContentDirectoryAdapterSystemIntegrationTest - CONFIGURATION SKIPPED 
19:12:21.276 [main                ] WARN  i.t.b.u.m.i.ClingContentDirectoryAdapterSystemIntegrationTest - CONFIGURATION SKIPPED 
19:12:21.277 [main                ] INFO  i.t.b.u.m.i.ClingContentDirectoryAdapterSystemIntegrationTest - ******************************
19:12:21.278 [main                ] INFO  i.t.b.u.m.i.ClingContentDirectoryAdapterSystemIntegrationTest - TEST "test service publishing"
19:12:21.278 [main                ] INFO  i.t.b.u.m.i.ClingContentDirectoryAdapterSystemIntegrationTest - ******************************
19:12:21.282 [main                ] INFO  i.t.b.u.m.i.ClingContentDirectoryAdapterSystemIntegrationTest - TEST SKIPPED 
19:12:21.283 [main                ] INFO  i.t.b.u.m.i.ClingContentDirectoryAdapterSystemIntegrationTest - 
19:12:21.283 [main                ] WARN  i.t.b.u.m.i.ClingContentDirectoryAdapterSystemIntegrationTest - CONFIGURATION SKIPPED 
19:12:21.285 [main                ] INFO  i.t.b.u.m.i.ClingContentDirectoryAdapterSystemIntegrationTest - TEST SKIPPED java.lang.Throwable: Method ClingContentDirectoryAdapterSystemIntegrationTest.test_sequence(java.lang.String, java.lang.String, java.lang.String)[pri:0, instance:it.tidalwave.bluemarine2.upnp.mediaserver.impl.ClingContentDirectoryAdapterSystemIntegrationTest@478db956] depends on not successfully finished methods
19:12:21.285 [main                ] INFO  i.t.b.u.m.i.ClingContentDirectoryAdapterSystemIntegrationTest - TEST SKIPPED
java.lang.Throwable: Method ClingContentDirectoryAdapterSystemIntegrationTest.test_sequence(java.lang.String, java.lang.String, java.lang.String)[pri:0, instance:it.tidalwave.bluemarine2.upnp.mediaserver.impl.ClingContentDirectoryAdapterSystemIntegrationTest@478db956] depends on not successfully finished methods
	at org.testng.internal.Invoker.invokeTestMethods(Invoker.java:1037)
	at org.testng.internal.TestMethodWorker.invokeTestMethods(TestMethodWorker.java:129)
	at org.testng.internal.TestMethodWorker.run(TestMethodWorker.java:112)
	at org.testng.TestRunner.privateRun(TestRunner.java:782)
	at org.testng.TestRunner.run(TestRunner.java:632)
	at org.testng.SuiteRunner.runTest(SuiteRunner.java:366)
	at org.testng.SuiteRunner.runSequentially(SuiteRunner.java:361)
	at org.testng.SuiteRunner.privateRun(SuiteRunner.java:319)
	at org.testng.SuiteRunner.run(SuiteRunner.java:268)
	at org.testng.SuiteRunnerWorker.runSuite(SuiteRunnerWorker.java:52)
	at org.testng.SuiteRunnerWorker.run(SuiteRunnerWorker.java:86)
	at org.testng.TestNG.runSuitesSequentially(TestNG.java:1244)
	at org.testng.TestNG.runSuitesLocally(TestNG.java:1169)
	at org.testng.TestNG.run(TestNG.java:1064)
	at org.apache.maven.surefire.testng.TestNGExecutor.run(TestNGExecutor.java:136)
	at org.apache.maven.surefire.testng.TestNGDirectoryTestSuite.executeMulti(TestNGDirectoryTestSuite.java:193)
	at org.apache.maven.surefire.testng.TestNGDirectoryTestSuite.execute(TestNGDirectoryTestSuite.java:94)
	at org.apache.maven.surefire.testng.TestNGProvider.invoke(TestNGProvider.java:145)
	at org.apache.maven.surefire.booter.ForkedBooter.runSuitesInProcess(ForkedBooter.java:428)
	at org.apache.maven.surefire.booter.ForkedBooter.execute(ForkedBooter.java:162)
	at org.apache.maven.surefire.booter.ForkedBooter.run(ForkedBooter.java:562)
	at org.apache.maven.surefire.booter.ForkedBooter.main(ForkedBooter.java:548)
19:12:21.288 [main                ] INFO  i.t.b.u.m.i.ClingContentDirectoryAdapterSystemIntegrationTest - 
19:12:21.290 [main                ] WARN  i.t.b.u.m.i.ClingContentDirectoryAdapterSystemIntegrationTest - CONFIGURATION SKIPPED 
19:12:21.294 [main                ] WARN  i.t.b.u.m.i.ClingContentDirectoryAdapterSystemIntegrationTest - CONFIGURATION SKIPPED 
19:12:21.295 [main                ] WARN  i.t.b.u.m.impl.device.DefaultDevicePublisherTest   - CONFIGURATION SKIPPED 
19:12:21.296 [main                ] WARN  i.t.b.u.m.impl.device.DefaultDevicePublisherTest   - CONFIGURATION SKIPPED 
19:12:21.299 [main                ] WARN  i.t.b.u.m.impl.device.DefaultDevicePublisherTest   - CONFIGURATION SKIPPED 
19:12:21.301 [main                ] INFO  i.t.b.u.m.impl.device.DefaultDevicePublisherTest   - *************************************
19:12:21.302 [main                ] INFO  i.t.b.u.m.impl.device.DefaultDevicePublisherTest   - TEST "must properly publish a device"
19:12:21.302 [main                ] INFO  i.t.b.u.m.impl.device.DefaultDevicePublisherTest   - *************************************
19:12:21.304 [main                ] INFO  i.t.b.u.m.impl.device.DefaultDevicePublisherTest   - TEST SKIPPED 
19:12:21.305 [main                ] INFO  i.t.b.u.m.impl.device.DefaultDevicePublisherTest   - 
19:12:21.306 [main                ] WARN  i.t.b.u.m.impl.device.DefaultDevicePublisherTest   - CONFIGURATION SKIPPED 
19:12:21.309 [main                ] WARN  i.t.b.u.m.impl.device.DefaultDevicePublisherTest   - CONFIGURATION SKIPPED 
19:12:21.310 [main                ] WARN  i.t.b.u.m.impl.didl.DIDLAdapterBindingTest         - CONFIGURATION SKIPPED 
19:12:21.311 [main                ] WARN  i.t.b.u.m.impl.didl.DIDLAdapterBindingTest         - CONFIGURATION SKIPPED 
19:12:21.312 [main                ] INFO  i.t.b.u.m.impl.didl.DIDLAdapterBindingTest         - ***********************************************
19:12:21.315 [main                ] INFO  i.t.b.u.m.impl.didl.DIDLAdapterBindingTest         - TEST "must find the correct adapter for Entity"
19:12:21.315 [main                ] INFO  i.t.b.u.m.impl.didl.DIDLAdapterBindingTest         - ***********************************************
19:12:21.317 [main                ] INFO  i.t.b.u.m.impl.didl.DIDLAdapterBindingTest         - TEST SKIPPED 
19:12:21.317 [main                ] INFO  i.t.b.u.m.impl.didl.DIDLAdapterBindingTest         - 
19:12:21.318 [main                ] WARN  i.t.b.u.m.impl.didl.DIDLAdapterBindingTest         - CONFIGURATION SKIPPED 
19:12:21.324 [main                ] WARN  i.t.b.u.m.impl.didl.DIDLAdapterBindingTest         - CONFIGURATION SKIPPED 
19:12:21.325 [main                ] INFO  i.t.b.u.m.impl.didl.DIDLAdapterBindingTest         - ****************************************************
19:12:21.326 [main                ] INFO  i.t.b.u.m.impl.didl.DIDLAdapterBindingTest         - TEST "must find the correct adapter for MusicArtist"
19:12:21.326 [main                ] INFO  i.t.b.u.m.impl.didl.DIDLAdapterBindingTest         - ****************************************************
19:12:21.333 [main                ] INFO  i.t.b.u.m.impl.didl.DIDLAdapterBindingTest         - TEST SKIPPED 
19:12:21.333 [main                ] INFO  i.t.b.u.m.impl.didl.DIDLAdapterBindingTest         - 
19:12:21.335 [main                ] WARN  i.t.b.u.m.impl.didl.DIDLAdapterBindingTest         - CONFIGURATION SKIPPED 
19:12:21.336 [main                ] WARN  i.t.b.u.m.impl.didl.DIDLAdapterBindingTest         - CONFIGURATION SKIPPED 
19:12:21.339 [main                ] INFO  i.t.b.u.m.impl.didl.DIDLAdapterBindingTest         - ***********************************************
19:12:21.340 [main                ] INFO  i.t.b.u.m.impl.didl.DIDLAdapterBindingTest         - TEST "must find the correct adapter for Record"
19:12:21.341 [main                ] INFO  i.t.b.u.m.impl.didl.DIDLAdapterBindingTest         - ***********************************************
19:12:21.341 [main                ] INFO  i.t.b.u.m.impl.didl.DIDLAdapterBindingTest         - TEST SKIPPED 
19:12:21.342 [main                ] INFO  i.t.b.u.m.impl.didl.DIDLAdapterBindingTest         - 
19:12:21.342 [main                ] WARN  i.t.b.u.m.impl.didl.DIDLAdapterBindingTest         - CONFIGURATION SKIPPED 
19:12:21.343 [main                ] WARN  i.t.b.u.m.impl.didl.DIDLAdapterBindingTest         - CONFIGURATION SKIPPED 
19:12:21.347 [main                ] INFO  i.t.b.u.m.impl.didl.DIDLAdapterBindingTest         - *********************************************************
19:12:21.348 [main                ] INFO  i.t.b.u.m.impl.didl.DIDLAdapterBindingTest         - TEST "must find the correct adapter for decorated Entity"
19:12:21.348 [main                ] INFO  i.t.b.u.m.impl.didl.DIDLAdapterBindingTest         - *********************************************************
19:12:21.349 [main                ] INFO  i.t.b.u.m.impl.didl.DIDLAdapterBindingTest         - TEST SKIPPED 
19:12:21.349 [main                ] INFO  i.t.b.u.m.impl.didl.DIDLAdapterBindingTest         - 
19:12:21.349 [main                ] WARN  i.t.b.u.m.impl.didl.DIDLAdapterBindingTest         - CONFIGURATION SKIPPED 
19:12:21.350 [main                ] WARN  i.t.b.u.m.impl.didl.DIDLAdapterBindingTest         - CONFIGURATION SKIPPED 
19:12:21.350 [main                ] INFO  i.t.b.u.m.impl.didl.DIDLAdapterBindingTest         - **************************************************************
19:12:21.351 [main                ] INFO  i.t.b.u.m.impl.didl.DIDLAdapterBindingTest         - TEST "must find the correct adapter for decorated MusicArtist"
19:12:21.351 [main                ] INFO  i.t.b.u.m.impl.didl.DIDLAdapterBindingTest         - **************************************************************
19:12:21.351 [main                ] INFO  i.t.b.u.m.impl.didl.DIDLAdapterBindingTest         - TEST SKIPPED 
19:12:21.352 [main                ] INFO  i.t.b.u.m.impl.didl.DIDLAdapterBindingTest         - 
19:12:21.353 [main                ] WARN  i.t.b.u.m.impl.didl.DIDLAdapterBindingTest         - CONFIGURATION SKIPPED 
19:12:21.364 [main                ] WARN  i.t.b.u.m.impl.didl.DIDLAdapterBindingTest         - CONFIGURATION SKIPPED 
19:12:21.368 [main                ] INFO  i.t.b.u.m.impl.didl.DIDLAdapterBindingTest         - *********************************************************
19:12:21.371 [main                ] INFO  i.t.b.u.m.impl.didl.DIDLAdapterBindingTest         - TEST "must find the correct adapter for decorated Record"
19:12:21.371 [main                ] INFO  i.t.b.u.m.impl.didl.DIDLAdapterBindingTest         - *********************************************************
19:12:21.371 [main                ] INFO  i.t.b.u.m.impl.didl.DIDLAdapterBindingTest         - TEST SKIPPED 
19:12:21.372 [main                ] INFO  i.t.b.u.m.impl.didl.DIDLAdapterBindingTest         - 
19:12:21.373 [main                ] WARN  i.t.b.u.m.impl.didl.DIDLAdapterBindingTest         - CONFIGURATION SKIPPED 
19:12:21.373 [main                ] WARN  i.t.b.u.m.impl.didl.DIDLAdapterBindingTest         - CONFIGURATION SKIPPED 
19:12:21.547 [main                ] INFO  i.t.b.u.m.i.ClingContentDirectoryAdapterSystemIntegrationTest - FINISHED TESTS OF it.tidalwave.bluemarine2.upnp.mediaserver.impl.ClingContentDirectoryAdapterSystemIntegrationTest
[ERROR] Tests run: 35, Failures: 1, Errors: 0, Skipped: 34, Time elapsed: 4.768 s <<< FAILURE! - in TestSuite
[ERROR] it.tidalwave.bluemarine2.upnp.mediaserver.impl.ClingContentDirectoryAdapterSystemIntegrationTest.beforeClass  Time elapsed: 4.102 s  <<< FAILURE!
org.springframework.beans.factory.CannotLoadBeanClassException: Cannot find class [it.tidalwave.role.spring.spi.AnnotationSpringRoleManager] for bean with name 'roleManager' defined in class path resource [META-INF/DciAutoBeans.xml]; nested exception is java.lang.ClassNotFoundException: it.tidalwave.role.spring.spi.AnnotationSpringRoleManager
Caused by: java.lang.ClassNotFoundException: it.tidalwave.role.spring.spi.AnnotationSpringRoleManager

[INFO] 
[INFO] Results:
[INFO] 
[ERROR] Failures: 
[ERROR]   ClingContentDirectoryAdapterSystemIntegrationTest>SpringTestSupport.beforeClass:93->SpringTestSupport.createSpringContext:109 » CannotLoadBeanClass
[INFO] 
[ERROR] Tests run: 25, Failures: 1, Errors: 0, Skipped: 24
[INFO] 
[ERROR] There are test failures.

Please refer to /var/jenkins_home/jobs/blueMarine2_Build_and_Quick_Test/workspace/modules/ClingMediaServer/target/surefire-reports/plain for the individual test results.
Please refer to dump files (if any exist) [date].dump, [date]-jvmRun[N].dump and [date].dumpstream.
[JENKINS] Recording test results
[INFO] 
[INFO] --- maven-jar-plugin:3.2.0:jar (default-jar) @ it-tidalwave-bluemarine2-upnp-mediaserver ---
[INFO] Building jar: /var/jenkins_home/jobs/blueMarine2_Build_and_Quick_Test/workspace/modules/ClingMediaServer/target/it-tidalwave-bluemarine2-upnp-mediaserver-1.1-ALPHA-2-SNAPSHOT.776aa35dcaa1.jar
[INFO] 
[INFO] --- maven-jar-plugin:3.2.0:test-jar (default-test-jar) @ it-tidalwave-bluemarine2-upnp-mediaserver ---
[INFO] Building jar: /var/jenkins_home/jobs/blueMarine2_Build_and_Quick_Test/workspace/modules/ClingMediaServer/target/it-tidalwave-bluemarine2-upnp-mediaserver-1.1-ALPHA-2-SNAPSHOT.776aa35dcaa1-tests.jar
[INFO] 
[INFO] --- maven-install-plugin:3.0.0-M1:install (default-install) @ it-tidalwave-bluemarine2-upnp-mediaserver ---
[INFO] Installing /var/jenkins_home/jobs/blueMarine2_Build_and_Quick_Test/workspace/modules/ClingMediaServer/target/it-tidalwave-bluemarine2-upnp-mediaserver-1.1-ALPHA-2-SNAPSHOT.776aa35dcaa1.jar to /var/jenkins_home/maven-repositories/0/it/tidalwave/bluemarine2/it-tidalwave-bluemarine2-upnp-mediaserver/1.1-ALPHA-2-SNAPSHOT/it-tidalwave-bluemarine2-upnp-mediaserver-1.1-ALPHA-2-SNAPSHOT.jar
[INFO] Installing /var/jenkins_home/jobs/blueMarine2_Build_and_Quick_Test/workspace/modules/ClingMediaServer/pom.xml to /var/jenkins_home/maven-repositories/0/it/tidalwave/bluemarine2/it-tidalwave-bluemarine2-upnp-mediaserver/1.1-ALPHA-2-SNAPSHOT/it-tidalwave-bluemarine2-upnp-mediaserver-1.1-ALPHA-2-SNAPSHOT.pom
[INFO] Installing /var/jenkins_home/jobs/blueMarine2_Build_and_Quick_Test/workspace/modules/ClingMediaServer/target/it-tidalwave-bluemarine2-upnp-mediaserver-1.1-ALPHA-2-SNAPSHOT.776aa35dcaa1-tests.jar to /var/jenkins_home/maven-repositories/0/it/tidalwave/bluemarine2/it-tidalwave-bluemarine2-upnp-mediaserver/1.1-ALPHA-2-SNAPSHOT/it-tidalwave-bluemarine2-upnp-mediaserver-1.1-ALPHA-2-SNAPSHOT-tests.jar
[JENKINS] Archiving disabled
Started calculate disk usage of build
Finished Calculation of disk usage of build in 0 seconds
Started calculate disk usage of workspace
Finished Calculation of disk usage of workspace in 0 seconds
[INFO] 
[INFO] ---< it.tidalwave.bluemarine2:it-tidalwave-bluemarine2-initializer >----
[INFO] Building blueMarine II :: Initializer 1.1-ALPHA-2-SNAPSHOT       [21/26]
[INFO] --------------------------------[ jar ]---------------------------------
[INFO] 
[INFO] --- maven-clean-plugin:3.1.0:clean (default-clean) @ it-tidalwave-bluemarine2-initializer ---
[INFO] 
[INFO] --- buildnumber-maven-plugin:1.4:create (default) @ it-tidalwave-bluemarine2-initializer ---
[INFO] ShortRevision tag detected. The value is '12'.
[INFO] Executing: /bin/sh -c cd '/var/jenkins_home/jobs/blueMarine2_Build_and_Quick_Test/workspace/modules/Initializer' && 'git' 'rev-parse' '--verify' '--short=12' 'HEAD'
[INFO] Working directory: /var/jenkins_home/jobs/blueMarine2_Build_and_Quick_Test/workspace/modules/Initializer
[INFO] Storing buildNumber: 776aa35dcaa1 at timestamp: 1674843144578
[WARNING] Cannot get the branch information from the git repository: 
Detecting the current branch failed: fatal: ref HEAD is not a symbolic ref

[INFO] ShortRevision tag detected. The value is '12'.
[INFO] Executing: /bin/sh -c cd '/var/jenkins_home/jobs/blueMarine2_Build_and_Quick_Test/workspace/modules/Initializer' && 'git' 'rev-parse' '--verify' '--short=12' 'HEAD'
[INFO] Working directory: /var/jenkins_home/jobs/blueMarine2_Build_and_Quick_Test/workspace/modules/Initializer
[INFO] Storing buildScmBranch: UNKNOWN
[INFO] 
[INFO] --- maven-enforcer-plugin:3.0.0-M3:enforce (enforce-maven) @ it-tidalwave-bluemarine2-initializer ---
[INFO] 
[INFO] --- maven-enforcer-plugin:3.0.0-M3:enforce (enforce-banned-dependencies) @ it-tidalwave-bluemarine2-initializer ---
[INFO] 
[INFO] --- maven-antrun-plugin:3.0.0:run (generate-and-print-build-description) @ it-tidalwave-bluemarine2-initializer ---
[INFO] Executing tasks
[INFO]      [echo] DESCRIPTION: origin/fabrizio.giudici 1.1-ALPHA-2-SNAPSHOT 776aa35dcaa1
[INFO]      [echo] Java Version: 11.0.10 -source 11 -target 11 -release 11
[INFO] Executed tasks
[INFO] 
[INFO] --- maven-resources-plugin:3.2.0:resources (default-resources) @ it-tidalwave-bluemarine2-initializer ---
[INFO] Using 'UTF-8' encoding to copy filtered resources.
[INFO] Using 'UTF-8' encoding to copy filtered properties files.
[INFO] Copying 1 resource
[INFO] 
[INFO] --- maven-compiler-plugin:3.8.1:compile (default-compile) @ it-tidalwave-bluemarine2-initializer ---
[INFO] Changes detected - recompiling the module!
[INFO] Compiling 2 source files to /var/jenkins_home/jobs/blueMarine2_Build_and_Quick_Test/workspace/modules/Initializer/target/classes
[WARNING] No processor claimed any of these annotations: /javax.inject.Inject,java.base/java.lang.Override,/javax.annotation.PreDestroy
[INFO] 
[INFO] --- maven-resources-plugin:3.2.0:testResources (default-testResources) @ it-tidalwave-bluemarine2-initializer ---
[INFO] Using 'UTF-8' encoding to copy filtered resources.
[INFO] Using 'UTF-8' encoding to copy filtered properties files.
[INFO] skip non existing resourceDirectory /var/jenkins_home/jobs/blueMarine2_Build_and_Quick_Test/workspace/modules/Initializer/src/test/resources
[INFO] 
[INFO] --- maven-compiler-plugin:3.8.1:testCompile (default-testCompile) @ it-tidalwave-bluemarine2-initializer ---
[INFO] No sources to compile
[INFO] 
[INFO] --- maven-surefire-plugin:3.0.0-M5:test (default-test) @ it-tidalwave-bluemarine2-initializer ---
[INFO] No tests to run.
[JENKINS] Recording test results
[INFO] 
[INFO] --- maven-jar-plugin:3.2.0:jar (default-jar) @ it-tidalwave-bluemarine2-initializer ---
[INFO] Building jar: /var/jenkins_home/jobs/blueMarine2_Build_and_Quick_Test/workspace/modules/Initializer/target/it-tidalwave-bluemarine2-initializer-1.1-ALPHA-2-SNAPSHOT.776aa35dcaa1.jar
[INFO] 
[INFO] --- maven-jar-plugin:3.2.0:test-jar (default-test-jar) @ it-tidalwave-bluemarine2-initializer ---
[INFO] Skipping packaging of the test-jar
[INFO] 
[INFO] --- maven-install-plugin:3.0.0-M1:install (default-install) @ it-tidalwave-bluemarine2-initializer ---
[INFO] Installing /var/jenkins_home/jobs/blueMarine2_Build_and_Quick_Test/workspace/modules/Initializer/target/it-tidalwave-bluemarine2-initializer-1.1-ALPHA-2-SNAPSHOT.776aa35dcaa1.jar to /var/jenkins_home/maven-repositories/0/it/tidalwave/bluemarine2/it-tidalwave-bluemarine2-initializer/1.1-ALPHA-2-SNAPSHOT/it-tidalwave-bluemarine2-initializer-1.1-ALPHA-2-SNAPSHOT.jar
[INFO] Installing /var/jenkins_home/jobs/blueMarine2_Build_and_Quick_Test/workspace/modules/Initializer/pom.xml to /var/jenkins_home/maven-repositories/0/it/tidalwave/bluemarine2/it-tidalwave-bluemarine2-initializer/1.1-ALPHA-2-SNAPSHOT/it-tidalwave-bluemarine2-initializer-1.1-ALPHA-2-SNAPSHOT.pom
[JENKINS] Archiving disabled
Started calculate disk usage of build
Finished Calculation of disk usage of build in 0 seconds
Started calculate disk usage of workspace
Finished Calculation of disk usage of workspace in 0 seconds
[INFO] 
[INFO] -------< it.tidalwave.bluemarine2:bluemarine2-services-modules >--------
[INFO] Building blueMarine II :: Services (modules) 1.1-ALPHA-2-SNAPSHOT [22/26]
[INFO] --------------------------------[ pom ]---------------------------------
[INFO] 
[INFO] --- maven-clean-plugin:3.1.0:clean (default-clean) @ bluemarine2-services-modules ---
[INFO] 
[INFO] --- buildnumber-maven-plugin:1.4:create (default) @ bluemarine2-services-modules ---
[INFO] ShortRevision tag detected. The value is '12'.
[INFO] Executing: /bin/sh -c cd '/var/jenkins_home/jobs/blueMarine2_Build_and_Quick_Test/workspace/modules/Services' && 'git' 'rev-parse' '--verify' '--short=12' 'HEAD'
[INFO] Working directory: /var/jenkins_home/jobs/blueMarine2_Build_and_Quick_Test/workspace/modules/Services
[INFO] Storing buildNumber: 776aa35dcaa1 at timestamp: 1674843152671
[WARNING] Cannot get the branch information from the git repository: 
Detecting the current branch failed: fatal: ref HEAD is not a symbolic ref

[INFO] ShortRevision tag detected. The value is '12'.
[INFO] Executing: /bin/sh -c cd '/var/jenkins_home/jobs/blueMarine2_Build_and_Quick_Test/workspace/modules/Services' && 'git' 'rev-parse' '--verify' '--short=12' 'HEAD'
[INFO] Working directory: /var/jenkins_home/jobs/blueMarine2_Build_and_Quick_Test/workspace/modules/Services
[INFO] Storing buildScmBranch: UNKNOWN
[INFO] 
[INFO] --- maven-enforcer-plugin:3.0.0-M3:enforce (enforce-maven) @ bluemarine2-services-modules ---
[INFO] 
[INFO] --- maven-enforcer-plugin:3.0.0-M3:enforce (enforce-banned-dependencies) @ bluemarine2-services-modules ---
[INFO] 
[INFO] --- maven-antrun-plugin:3.0.0:run (generate-and-print-build-description) @ bluemarine2-services-modules ---
[INFO] Executing tasks
[INFO]      [echo] DESCRIPTION: origin/fabrizio.giudici 1.1-ALPHA-2-SNAPSHOT 776aa35dcaa1
[INFO]      [echo] Java Version: 11.0.10 -source 11 -target 11 -release 11
[INFO] Executed tasks
[INFO] 
[INFO] --- maven-jar-plugin:3.2.0:test-jar (default-test-jar) @ bluemarine2-services-modules ---
[INFO] Skipping packaging of the test-jar
[INFO] 
[INFO] --- maven-install-plugin:3.0.0-M1:install (default-install) @ bluemarine2-services-modules ---
[INFO] Installing /var/jenkins_home/jobs/blueMarine2_Build_and_Quick_Test/workspace/modules/Services/pom.xml to /var/jenkins_home/maven-repositories/0/it/tidalwave/bluemarine2/bluemarine2-services-modules/1.1-ALPHA-2-SNAPSHOT/bluemarine2-services-modules-1.1-ALPHA-2-SNAPSHOT.pom
[JENKINS] Archiving disabled
Started calculate disk usage of build
Finished Calculation of disk usage of build in 0 seconds
Started calculate disk usage of workspace
Finished Calculation of disk usage of workspace in 0 seconds
[INFO] 
[INFO] --< it.tidalwave.bluemarine2:it-tidalwave-bluemarine2-services-stoppingdown >--
[INFO] Building blueMarine II :: Services :: StoppingDown 1.1-ALPHA-2-SNAPSHOT [23/26]
[INFO] --------------------------------[ jar ]---------------------------------
[INFO] 
[INFO] --- maven-clean-plugin:3.1.0:clean (default-clean) @ it-tidalwave-bluemarine2-services-stoppingdown ---
[INFO] 
[INFO] --- buildnumber-maven-plugin:1.4:create (default) @ it-tidalwave-bluemarine2-services-stoppingdown ---
[INFO] ShortRevision tag detected. The value is '12'.
[INFO] Executing: /bin/sh -c cd '/var/jenkins_home/jobs/blueMarine2_Build_and_Quick_Test/workspace/modules/Services/StoppingDown' && 'git' 'rev-parse' '--verify' '--short=12' 'HEAD'
[INFO] Working directory: /var/jenkins_home/jobs/blueMarine2_Build_and_Quick_Test/workspace/modules/Services/StoppingDown
[INFO] Storing buildNumber: 776aa35dcaa1 at timestamp: 1674843154278
[WARNING] Cannot get the branch information from the git repository: 
Detecting the current branch failed: fatal: ref HEAD is not a symbolic ref

[INFO] ShortRevision tag detected. The value is '12'.
[INFO] Executing: /bin/sh -c cd '/var/jenkins_home/jobs/blueMarine2_Build_and_Quick_Test/workspace/modules/Services/StoppingDown' && 'git' 'rev-parse' '--verify' '--short=12' 'HEAD'
[INFO] Working directory: /var/jenkins_home/jobs/blueMarine2_Build_and_Quick_Test/workspace/modules/Services/StoppingDown
[INFO] Storing buildScmBranch: UNKNOWN
[INFO] 
[INFO] --- maven-enforcer-plugin:3.0.0-M3:enforce (enforce-maven) @ it-tidalwave-bluemarine2-services-stoppingdown ---
[INFO] 
[INFO] --- maven-enforcer-plugin:3.0.0-M3:enforce (enforce-banned-dependencies) @ it-tidalwave-bluemarine2-services-stoppingdown ---
[INFO] 
[INFO] --- maven-antrun-plugin:3.0.0:run (generate-and-print-build-description) @ it-tidalwave-bluemarine2-services-stoppingdown ---
[INFO] Executing tasks
[INFO]      [echo] DESCRIPTION: origin/fabrizio.giudici 1.1-ALPHA-2-SNAPSHOT 776aa35dcaa1
[INFO]      [echo] Java Version: 11.0.10 -source 11 -target 11 -release 11
[INFO] Executed tasks
[INFO] 
[INFO] --- maven-resources-plugin:3.2.0:resources (default-resources) @ it-tidalwave-bluemarine2-services-stoppingdown ---
[INFO] Using 'UTF-8' encoding to copy filtered resources.
[INFO] Using 'UTF-8' encoding to copy filtered properties files.
[INFO] Copying 1 resource
[INFO] 
[INFO] --- maven-compiler-plugin:3.8.1:compile (default-compile) @ it-tidalwave-bluemarine2-services-stoppingdown ---
[INFO] Changes detected - recompiling the module!
[INFO] Compiling 8 source files to /var/jenkins_home/jobs/blueMarine2_Build_and_Quick_Test/workspace/modules/Services/StoppingDown/target/classes
[WARNING] No processor claimed any of these annotations: /it.tidalwave.dci.annotation.DciRole,/javax.annotation.Nonnull,/it.tidalwave.util.annotation.VisibleForTesting,/javax.inject.Named,/javax.annotation.concurrent.Immutable,java.base/java.lang.Override,/javax.inject.Inject,/org.springframework.scheduling.annotation.Scheduled
[INFO] 
[INFO] --- maven-resources-plugin:3.2.0:testResources (default-testResources) @ it-tidalwave-bluemarine2-services-stoppingdown ---
[INFO] Using 'UTF-8' encoding to copy filtered resources.
[INFO] Using 'UTF-8' encoding to copy filtered properties files.
[INFO] Copying 203 resources
[INFO] 
[INFO] --- maven-compiler-plugin:3.8.1:testCompile (default-testCompile) @ it-tidalwave-bluemarine2-services-stoppingdown ---
[INFO] Changes detected - recompiling the module!
[INFO] Compiling 6 source files to /var/jenkins_home/jobs/blueMarine2_Build_and_Quick_Test/workspace/modules/Services/StoppingDown/target/test-classes
[WARNING] No processor claimed any of these annotations: /org.testng.annotations.Test,/org.testng.annotations.DataProvider,/javax.annotation.Nonnull,/org.testng.annotations.BeforeMethod
[WARNING] /var/jenkins_home/jobs/blueMarine2_Build_and_Quick_Test/workspace/modules/Services/StoppingDown/src/test/java/it/tidalwave/bluemarine2/service/stoppingdown/impl/PhotoCollectionProviderTestSupport.java:[78,33] [unchecked] unchecked method invocation: method finderOf in interface MediaFolder is applied to given types
  required: Finder<PathAwareEntity>
  found: Finder
[WARNING] /var/jenkins_home/jobs/blueMarine2_Build_and_Quick_Test/workspace/modules/Services/StoppingDown/src/test/java/it/tidalwave/bluemarine2/service/stoppingdown/impl/PhotoCollectionProviderTestSupport.java:[78,37] [unchecked] unchecked conversion
  required: Finder<PathAwareEntity>
  found:    Finder
[WARNING] /var/jenkins_home/jobs/blueMarine2_Build_and_Quick_Test/workspace/modules/Services/StoppingDown/src/test/java/it/tidalwave/bluemarine2/service/stoppingdown/impl/PhotoCollectionProviderTestSupport.java:[79,33] [unchecked] unchecked method invocation: method finderOf in interface MediaFolder is applied to given types
  required: Function<MediaFolder,Collection<? extends PathAwareEntity>>
  found: Function
[WARNING] /var/jenkins_home/jobs/blueMarine2_Build_and_Quick_Test/workspace/modules/Services/StoppingDown/src/test/java/it/tidalwave/bluemarine2/service/stoppingdown/impl/PhotoCollectionProviderTestSupport.java:[79,37] [unchecked] unchecked conversion
  required: Function<MediaFolder,Collection<? extends PathAwareEntity>>
  found:    Function
[INFO] 
[INFO] --- maven-surefire-plugin:3.0.0-M5:test (default-test) @ it-tidalwave-bluemarine2-services-stoppingdown ---
[INFO] 
[INFO] -------------------------------------------------------
[INFO]  T E S T S
[INFO] -------------------------------------------------------
[INFO] Running TestSuite
19:12:58.599 [main                ] INFO  i.t.b.s.s.impl.DiaryPhotoCollectionProviderTest    - STARTING TESTS OF it.tidalwave.bluemarine2.service.stoppingdown.impl.DiaryPhotoCollectionProviderTest
19:12:58.648 [main                ] INFO  i.t.bluemarine2.commons.test.SpringTestSupport     - Spring configuration locations: [META-INF/DciAutoBeans.xml, META-INF/MockBeans.xml]
19:12:59.861 [main                ] WARN  o.s.context.support.ClassPathXmlApplicationContext - Exception encountered during context initialization - cancelling refresh attempt: org.springframework.beans.factory.CannotLoadBeanClassException: Cannot find class [it.tidalwave.role.spring.spi.AnnotationSpringRoleManager] for bean with name 'roleManager' defined in class path resource [META-INF/DciAutoBeans.xml]; nested exception is java.lang.ClassNotFoundException: it.tidalwave.role.spring.spi.AnnotationSpringRoleManager
19:12:59.883 [main                ] ERROR i.t.b.s.s.impl.DiaryPhotoCollectionProviderTest    - CONFIGURATION FAILED org.springframework.beans.factory.CannotLoadBeanClassException: Cannot find class [it.tidalwave.role.spring.spi.AnnotationSpringRoleManager] for bean with name 'roleManager' defined in class path resource [META-INF/DciAutoBeans.xml]; nested exception is java.lang.ClassNotFoundException: it.tidalwave.role.spring.spi.AnnotationSpringRoleManager
19:12:59.886 [main                ] ERROR i.t.b.s.s.impl.DiaryPhotoCollectionProviderTest    - CONFIGURATION FAILED
org.springframework.beans.factory.CannotLoadBeanClassException: Cannot find class [it.tidalwave.role.spring.spi.AnnotationSpringRoleManager] for bean with name 'roleManager' defined in class path resource [META-INF/DciAutoBeans.xml]; nested exception is java.lang.ClassNotFoundException: it.tidalwave.role.spring.spi.AnnotationSpringRoleManager
	at org.springframework.beans.factory.support.AbstractBeanFactory.resolveBeanClass(AbstractBeanFactory.java:1537)
	at org.springframework.beans.factory.support.AbstractAutowireCapableBeanFactory.determineTargetType(AbstractAutowireCapableBeanFactory.java:693)
	at org.springframework.beans.factory.support.AbstractAutowireCapableBeanFactory.predictBeanType(AbstractAutowireCapableBeanFactory.java:663)
	at org.springframework.beans.factory.support.AbstractBeanFactory.isFactoryBean(AbstractBeanFactory.java:1665)
	at org.springframework.beans.factory.support.AbstractBeanFactory.isFactoryBean(AbstractBeanFactory.java:1142)
	at org.springframework.beans.factory.support.DefaultListableBeanFactory.preInstantiateSingletons(DefaultListableBeanFactory.java:924)
	at org.springframework.context.support.AbstractApplicationContext.finishBeanFactoryInitialization(AbstractApplicationContext.java:925)
	at org.springframework.context.support.AbstractApplicationContext.refresh(AbstractApplicationContext.java:588)
	at org.springframework.context.support.ClassPathXmlApplicationContext.<init>(ClassPathXmlApplicationContext.java:144)
	at org.springframework.context.support.ClassPathXmlApplicationContext.<init>(ClassPathXmlApplicationContext.java:95)
	at it.tidalwave.bluemarine2.commons.test.SpringTestSupport.createSpringContext(SpringTestSupport.java:109)
	at it.tidalwave.bluemarine2.commons.test.SpringTestSupport.beforeMethod(SpringTestSupport.java:75)
	at java.base/jdk.internal.reflect.NativeMethodAccessorImpl.invoke0(Native Method)
	at java.base/jdk.internal.reflect.NativeMethodAccessorImpl.invoke(NativeMethodAccessorImpl.java:62)
	at java.base/jdk.internal.reflect.DelegatingMethodAccessorImpl.invoke(DelegatingMethodAccessorImpl.java:43)
	at java.base/java.lang.reflect.Method.invoke(Method.java:566)
	at org.testng.internal.MethodInvocationHelper.invokeMethod(MethodInvocationHelper.java:86)
	at org.testng.internal.Invoker.invokeConfigurationMethod(Invoker.java:514)
	at org.testng.internal.Invoker.invokeConfigurations(Invoker.java:215)
	at org.testng.internal.Invoker.invokeMethod(Invoker.java:589)
	at org.testng.internal.Invoker.invokeTestMethod(Invoker.java:820)
	at org.testng.internal.Invoker.invokeTestMethods(Invoker.java:1128)
	at org.testng.internal.TestMethodWorker.invokeTestMethods(TestMethodWorker.java:129)
	at org.testng.internal.TestMethodWorker.run(TestMethodWorker.java:112)
	at org.testng.TestRunner.privateRun(TestRunner.java:782)
	at org.testng.TestRunner.run(TestRunner.java:632)
	at org.testng.SuiteRunner.runTest(SuiteRunner.java:366)
	at org.testng.SuiteRunner.runSequentially(SuiteRunner.java:361)
	at org.testng.SuiteRunner.privateRun(SuiteRunner.java:319)
	at org.testng.SuiteRunner.run(SuiteRunner.java:268)
	at org.testng.SuiteRunnerWorker.runSuite(SuiteRunnerWorker.java:52)
	at org.testng.SuiteRunnerWorker.run(SuiteRunnerWorker.java:86)
	at org.testng.TestNG.runSuitesSequentially(TestNG.java:1244)
	at org.testng.TestNG.runSuitesLocally(TestNG.java:1169)
	at org.testng.TestNG.run(TestNG.java:1064)
	at org.apache.maven.surefire.testng.TestNGExecutor.run(TestNGExecutor.java:136)
	at org.apache.maven.surefire.testng.TestNGDirectoryTestSuite.executeMulti(TestNGDirectoryTestSuite.java:193)
	at org.apache.maven.surefire.testng.TestNGDirectoryTestSuite.execute(TestNGDirectoryTestSuite.java:94)
	at org.apache.maven.surefire.testng.TestNGProvider.invoke(TestNGProvider.java:145)
	at org.apache.maven.surefire.booter.ForkedBooter.runSuitesInProcess(ForkedBooter.java:428)
	at org.apache.maven.surefire.booter.ForkedBooter.execute(ForkedBooter.java:162)
	at org.apache.maven.surefire.booter.ForkedBooter.run(ForkedBooter.java:562)
	at org.apache.maven.surefire.booter.ForkedBooter.main(ForkedBooter.java:548)
Caused by: java.lang.ClassNotFoundException: it.tidalwave.role.spring.spi.AnnotationSpringRoleManager
	at java.base/jdk.internal.loader.BuiltinClassLoader.loadClass(BuiltinClassLoader.java:581)
	at java.base/jdk.internal.loader.ClassLoaders$AppClassLoader.loadClass(ClassLoaders.java:178)
	at java.base/java.lang.ClassLoader.loadClass(ClassLoader.java:522)
	at java.base/java.lang.Class.forName0(Native Method)
	at java.base/java.lang.Class.forName(Class.java:398)
	at org.springframework.util.ClassUtils.forName(ClassUtils.java:284)
	at org.springframework.beans.factory.support.AbstractBeanDefinition.resolveBeanClass(AbstractBeanDefinition.java:469)
	at org.springframework.beans.factory.support.AbstractBeanFactory.doResolveBeanClass(AbstractBeanFactory.java:1602)
	at org.springframework.beans.factory.support.AbstractBeanFactory.resolveBeanClass(AbstractBeanFactory.java:1529)
	... 42 common frames omitted
19:12:59.890 [main                ] WARN  i.t.b.s.s.impl.DiaryPhotoCollectionProviderTest    - CONFIGURATION SKIPPED 
19:12:59.891 [main                ] INFO  i.t.b.s.s.impl.DiaryPhotoCollectionProviderTest    - ********************************
19:12:59.894 [main                ] INFO  i.t.b.s.s.impl.DiaryPhotoCollectionProviderTest    - TEST "must properly parse diary"
19:12:59.894 [main                ] INFO  i.t.b.s.s.impl.DiaryPhotoCollectionProviderTest    - ********************************
19:12:59.895 [main                ] INFO  i.t.b.s.s.impl.DiaryPhotoCollectionProviderTest    - TEST SKIPPED 
19:12:59.895 [main                ] INFO  i.t.b.s.s.impl.DiaryPhotoCollectionProviderTest    - 
19:12:59.907 [main                ] WARN  i.t.b.s.s.impl.DiaryPhotoCollectionProviderTest    - CONFIGURATION SKIPPED 
19:12:59.914 [main                ] INFO  i.t.b.s.s.impl.DiaryPhotoCollectionProviderTest    - TEST SKIPPED java.lang.Throwable: Method DiaryPhotoCollectionProviderTest.must_properly_create_hierarchy()[pri:0, instance:it.tidalwave.bluemarine2.service.stoppingdown.impl.DiaryPhotoCollectionProviderTest@7283d3eb] depends on not successfully finished methods
19:12:59.914 [main                ] INFO  i.t.b.s.s.impl.DiaryPhotoCollectionProviderTest    - TEST SKIPPED
java.lang.Throwable: Method DiaryPhotoCollectionProviderTest.must_properly_create_hierarchy()[pri:0, instance:it.tidalwave.bluemarine2.service.stoppingdown.impl.DiaryPhotoCollectionProviderTest@7283d3eb] depends on not successfully finished methods
	at org.testng.internal.Invoker.invokeTestMethods(Invoker.java:1037)
	at org.testng.internal.TestMethodWorker.invokeTestMethods(TestMethodWorker.java:129)
	at org.testng.internal.TestMethodWorker.run(TestMethodWorker.java:112)
	at org.testng.TestRunner.privateRun(TestRunner.java:782)
	at org.testng.TestRunner.run(TestRunner.java:632)
	at org.testng.SuiteRunner.runTest(SuiteRunner.java:366)
	at org.testng.SuiteRunner.runSequentially(SuiteRunner.java:361)
	at org.testng.SuiteRunner.privateRun(SuiteRunner.java:319)
	at org.testng.SuiteRunner.run(SuiteRunner.java:268)
	at org.testng.SuiteRunnerWorker.runSuite(SuiteRunnerWorker.java:52)
	at org.testng.SuiteRunnerWorker.run(SuiteRunnerWorker.java:86)
	at org.testng.TestNG.runSuitesSequentially(TestNG.java:1244)
	at org.testng.TestNG.runSuitesLocally(TestNG.java:1169)
	at org.testng.TestNG.run(TestNG.java:1064)
	at org.apache.maven.surefire.testng.TestNGExecutor.run(TestNGExecutor.java:136)
	at org.apache.maven.surefire.testng.TestNGDirectoryTestSuite.executeMulti(TestNGDirectoryTestSuite.java:193)
	at org.apache.maven.surefire.testng.TestNGDirectoryTestSuite.execute(TestNGDirectoryTestSuite.java:94)
	at org.apache.maven.surefire.testng.TestNGProvider.invoke(TestNGProvider.java:145)
	at org.apache.maven.surefire.booter.ForkedBooter.runSuitesInProcess(ForkedBooter.java:428)
	at org.apache.maven.surefire.booter.ForkedBooter.execute(ForkedBooter.java:162)
	at org.apache.maven.surefire.booter.ForkedBooter.run(ForkedBooter.java:562)
	at org.apache.maven.surefire.booter.ForkedBooter.main(ForkedBooter.java:548)
19:12:59.915 [main                ] INFO  i.t.b.s.s.impl.DiaryPhotoCollectionProviderTest    - 
19:12:59.917 [main                ] WARN  i.t.b.s.s.impl.DiaryPhotoCollectionProviderTest    - CONFIGURATION SKIPPED 
19:12:59.919 [main                ] WARN  i.t.b.s.s.impl.PhotoCollectionProviderSupportTest  - CONFIGURATION SKIPPED 
19:12:59.927 [main                ] WARN  i.t.b.s.s.impl.PhotoCollectionProviderSupportTest  - CONFIGURATION SKIPPED 
19:12:59.928 [main                ] WARN  i.t.b.s.s.impl.PhotoCollectionProviderSupportTest  - CONFIGURATION SKIPPED 
19:12:59.929 [main                ] INFO  i.t.b.s.s.impl.PhotoCollectionProviderSupportTest  - *************************************
19:12:59.929 [main                ] INFO  i.t.b.s.s.impl.PhotoCollectionProviderSupportTest  - TEST "must properly parse PhotoItems"
19:12:59.929 [main                ] INFO  i.t.b.s.s.impl.PhotoCollectionProviderSupportTest  - *************************************
19:12:59.930 [main                ] INFO  i.t.b.s.s.impl.PhotoCollectionProviderSupportTest  - TEST SKIPPED 
19:12:59.932 [main                ] INFO  i.t.b.s.s.impl.PhotoCollectionProviderSupportTest  - 
19:12:59.934 [main                ] WARN  i.t.b.s.s.impl.PhotoCollectionProviderSupportTest  - CONFIGURATION SKIPPED 
19:12:59.937 [main                ] WARN  i.t.b.s.s.impl.PhotoCollectionProviderSupportTest  - CONFIGURATION SKIPPED 
19:12:59.938 [main                ] WARN  i.t.b.s.stoppingdown.impl.PhotoItemDIDLAdapterTest - CONFIGURATION SKIPPED 
19:12:59.940 [main                ] WARN  i.t.b.s.stoppingdown.impl.PhotoItemDIDLAdapterTest - CONFIGURATION SKIPPED 
19:12:59.940 [main                ] INFO  i.t.b.s.stoppingdown.impl.PhotoItemDIDLAdapterTest - ******************************************
19:12:59.940 [main                ] INFO  i.t.b.s.stoppingdown.impl.PhotoItemDIDLAdapterTest - TEST "must properly generate DIDL content"
19:12:59.940 [main                ] INFO  i.t.b.s.stoppingdown.impl.PhotoItemDIDLAdapterTest - ******************************************
19:12:59.941 [main                ] INFO  i.t.b.s.stoppingdown.impl.PhotoItemDIDLAdapterTest - TEST SKIPPED 
19:12:59.946 [main                ] INFO  i.t.b.s.stoppingdown.impl.PhotoItemDIDLAdapterTest - 
19:12:59.950 [main                ] WARN  i.t.b.s.stoppingdown.impl.PhotoItemDIDLAdapterTest - CONFIGURATION SKIPPED 
19:12:59.951 [main                ] WARN  i.t.b.s.stoppingdown.impl.PhotoItemDIDLAdapterTest - CONFIGURATION SKIPPED 
19:12:59.952 [main                ] WARN  i.t.b.s.s.i.StoppingDownMediaServerServiceIntegrationTest - CONFIGURATION SKIPPED 
19:12:59.953 [main                ] WARN  i.t.b.s.s.i.StoppingDownMediaServerServiceIntegrationTest - CONFIGURATION SKIPPED 
19:12:59.962 [main                ] WARN  i.t.b.s.s.i.StoppingDownMediaServerServiceIntegrationTest - CONFIGURATION SKIPPED 
19:12:59.967 [main                ] INFO  i.t.b.s.s.i.StoppingDownMediaServerServiceIntegrationTest - ******************************
19:12:59.967 [main                ] INFO  i.t.b.s.s.i.StoppingDownMediaServerServiceIntegrationTest - TEST "test service publishing"
19:12:59.968 [main                ] INFO  i.t.b.s.s.i.StoppingDownMediaServerServiceIntegrationTest - ******************************
19:12:59.978 [main                ] INFO  i.t.b.s.s.i.StoppingDownMediaServerServiceIntegrationTest - TEST SKIPPED 
19:12:59.980 [main                ] INFO  i.t.b.s.s.i.StoppingDownMediaServerServiceIntegrationTest - 
19:12:59.981 [main                ] WARN  i.t.b.s.s.i.StoppingDownMediaServerServiceIntegrationTest - CONFIGURATION SKIPPED 
19:12:59.981 [main                ] WARN  i.t.b.s.s.i.StoppingDownMediaServerServiceIntegrationTest - CONFIGURATION SKIPPED 
19:12:59.982 [main                ] WARN  i.t.b.s.s.impl.ThemesPhotoCollectionProviderTest   - CONFIGURATION SKIPPED 
19:13:00.067 [main                ] WARN  i.t.b.s.s.impl.ThemesPhotoCollectionProviderTest   - CONFIGURATION SKIPPED 
19:13:00.071 [main                ] WARN  i.t.b.s.s.impl.ThemesPhotoCollectionProviderTest   - CONFIGURATION SKIPPED 
19:13:00.074 [main                ] INFO  i.t.b.s.s.impl.ThemesPhotoCollectionProviderTest   - **************************************************************************************
19:13:00.075 [main                ] INFO  i.t.b.s.s.impl.ThemesPhotoCollectionProviderTest   - TEST "must properly parse themes"
19:13:00.075 [main                ] INFO  i.t.b.s.s.impl.ThemesPhotoCollectionProviderTest   - ARGS [themes.txt, com.sun.org.apache.xpath.internal.jaxp.XPathExpressionImpl@7d61eccf]
19:13:00.076 [main                ] INFO  i.t.b.s.s.impl.ThemesPhotoCollectionProviderTest   - **************************************************************************************
19:13:00.090 [main                ] INFO  i.t.b.s.s.impl.ThemesPhotoCollectionProviderTest   - TEST SKIPPED 
19:13:00.090 [main                ] INFO  i.t.b.s.s.impl.ThemesPhotoCollectionProviderTest   - 
19:13:00.091 [main                ] WARN  i.t.b.s.s.impl.ThemesPhotoCollectionProviderTest   - CONFIGURATION SKIPPED 
19:13:00.094 [main                ] WARN  i.t.b.s.s.impl.ThemesPhotoCollectionProviderTest   - CONFIGURATION SKIPPED 
19:13:00.095 [main                ] WARN  i.t.b.s.s.impl.ThemesPhotoCollectionProviderTest   - CONFIGURATION SKIPPED 
19:13:00.095 [main                ] INFO  i.t.b.s.s.impl.ThemesPhotoCollectionProviderTest   - **************************************************************************************
19:13:00.095 [main                ] INFO  i.t.b.s.s.impl.ThemesPhotoCollectionProviderTest   - TEST "must properly parse themes"
19:13:00.095 [main                ] INFO  i.t.b.s.s.impl.ThemesPhotoCollectionProviderTest   - ARGS [places.txt, com.sun.org.apache.xpath.internal.jaxp.XPathExpressionImpl@2427e004]
19:13:00.095 [main                ] INFO  i.t.b.s.s.impl.ThemesPhotoCollectionProviderTest   - **************************************************************************************
19:13:00.096 [main                ] INFO  i.t.b.s.s.impl.ThemesPhotoCollectionProviderTest   - TEST SKIPPED 
19:13:00.096 [main                ] INFO  i.t.b.s.s.impl.ThemesPhotoCollectionProviderTest   - 
19:13:00.102 [main                ] WARN  i.t.b.s.s.impl.ThemesPhotoCollectionProviderTest   - CONFIGURATION SKIPPED 
19:13:00.104 [main                ] INFO  i.t.b.s.s.impl.ThemesPhotoCollectionProviderTest   - TEST SKIPPED java.lang.Throwable: Method ThemesPhotoCollectionProviderTest.must_properly_create_hierarchy()[pri:0, instance:it.tidalwave.bluemarine2.service.stoppingdown.impl.ThemesPhotoCollectionProviderTest@47c81abf] depends on not successfully finished methods
19:13:00.104 [main                ] INFO  i.t.b.s.s.impl.ThemesPhotoCollectionProviderTest   - TEST SKIPPED
java.lang.Throwable: Method ThemesPhotoCollectionProviderTest.must_properly_create_hierarchy()[pri:0, instance:it.tidalwave.bluemarine2.service.stoppingdown.impl.ThemesPhotoCollectionProviderTest@47c81abf] depends on not successfully finished methods
	at org.testng.internal.Invoker.invokeTestMethods(Invoker.java:1037)
	at org.testng.internal.TestMethodWorker.invokeTestMethods(TestMethodWorker.java:129)
	at org.testng.internal.TestMethodWorker.run(TestMethodWorker.java:112)
	at org.testng.TestRunner.privateRun(TestRunner.java:782)
	at org.testng.TestRunner.run(TestRunner.java:632)
	at org.testng.SuiteRunner.runTest(SuiteRunner.java:366)
	at org.testng.SuiteRunner.runSequentially(SuiteRunner.java:361)
	at org.testng.SuiteRunner.privateRun(SuiteRunner.java:319)
	at org.testng.SuiteRunner.run(SuiteRunner.java:268)
	at org.testng.SuiteRunnerWorker.runSuite(SuiteRunnerWorker.java:52)
	at org.testng.SuiteRunnerWorker.run(SuiteRunnerWorker.java:86)
	at org.testng.TestNG.runSuitesSequentially(TestNG.java:1244)
	at org.testng.TestNG.runSuitesLocally(TestNG.java:1169)
	at org.testng.TestNG.run(TestNG.java:1064)
	at org.apache.maven.surefire.testng.TestNGExecutor.run(TestNGExecutor.java:136)
	at org.apache.maven.surefire.testng.TestNGDirectoryTestSuite.executeMulti(TestNGDirectoryTestSuite.java:193)
	at org.apache.maven.surefire.testng.TestNGDirectoryTestSuite.execute(TestNGDirectoryTestSuite.java:94)
	at org.apache.maven.surefire.testng.TestNGProvider.invoke(TestNGProvider.java:145)
	at org.apache.maven.surefire.booter.ForkedBooter.runSuitesInProcess(ForkedBooter.java:428)
	at org.apache.maven.surefire.booter.ForkedBooter.execute(ForkedBooter.java:162)
	at org.apache.maven.surefire.booter.ForkedBooter.run(ForkedBooter.java:562)
	at org.apache.maven.surefire.booter.ForkedBooter.main(ForkedBooter.java:548)
19:13:00.105 [main                ] INFO  i.t.b.s.s.impl.ThemesPhotoCollectionProviderTest   - 
19:13:00.108 [main                ] WARN  i.t.b.s.s.impl.ThemesPhotoCollectionProviderTest   - CONFIGURATION SKIPPED 
19:13:00.287 [main                ] INFO  i.t.b.s.s.impl.DiaryPhotoCollectionProviderTest    - FINISHED TESTS OF it.tidalwave.bluemarine2.service.stoppingdown.impl.DiaryPhotoCollectionProviderTest
[ERROR] Tests run: 34, Failures: 1, Errors: 0, Skipped: 33, Time elapsed: 3.22 s <<< FAILURE! - in TestSuite
[ERROR] it.tidalwave.bluemarine2.service.stoppingdown.impl.DiaryPhotoCollectionProviderTest.beforeMethod  Time elapsed: 2.474 s  <<< FAILURE!
org.springframework.beans.factory.CannotLoadBeanClassException: Cannot find class [it.tidalwave.role.spring.spi.AnnotationSpringRoleManager] for bean with name 'roleManager' defined in class path resource [META-INF/DciAutoBeans.xml]; nested exception is java.lang.ClassNotFoundException: it.tidalwave.role.spring.spi.AnnotationSpringRoleManager
Caused by: java.lang.ClassNotFoundException: it.tidalwave.role.spring.spi.AnnotationSpringRoleManager

[INFO] 
[INFO] Results:
[INFO] 
[ERROR] Failures: 
[ERROR]   DiaryPhotoCollectionProviderTest>SpringTestSupport.beforeMethod:75->SpringTestSupport.createSpringContext:109 » CannotLoadBeanClass
[INFO] 
[ERROR] Tests run: 31, Failures: 1, Errors: 0, Skipped: 30
[INFO] 
[ERROR] There are test failures.

Please refer to /var/jenkins_home/jobs/blueMarine2_Build_and_Quick_Test/workspace/modules/Services/StoppingDown/target/surefire-reports/plain for the individual test results.
Please refer to dump files (if any exist) [date].dump, [date]-jvmRun[N].dump and [date].dumpstream.
[JENKINS] Recording test results
[INFO] 
[INFO] --- maven-jar-plugin:3.2.0:jar (default-jar) @ it-tidalwave-bluemarine2-services-stoppingdown ---
[INFO] Building jar: /var/jenkins_home/jobs/blueMarine2_Build_and_Quick_Test/workspace/modules/Services/StoppingDown/target/it-tidalwave-bluemarine2-services-stoppingdown-1.1-ALPHA-2-SNAPSHOT.776aa35dcaa1.jar
[INFO] 
[INFO] --- maven-jar-plugin:3.2.0:test-jar (default-test-jar) @ it-tidalwave-bluemarine2-services-stoppingdown ---
[INFO] Building jar: /var/jenkins_home/jobs/blueMarine2_Build_and_Quick_Test/workspace/modules/Services/StoppingDown/target/it-tidalwave-bluemarine2-services-stoppingdown-1.1-ALPHA-2-SNAPSHOT.776aa35dcaa1-tests.jar
[INFO] 
[INFO] --- maven-install-plugin:3.0.0-M1:install (default-install) @ it-tidalwave-bluemarine2-services-stoppingdown ---
[INFO] Installing /var/jenkins_home/jobs/blueMarine2_Build_and_Quick_Test/workspace/modules/Services/StoppingDown/target/it-tidalwave-bluemarine2-services-stoppingdown-1.1-ALPHA-2-SNAPSHOT.776aa35dcaa1.jar to /var/jenkins_home/maven-repositories/0/it/tidalwave/bluemarine2/it-tidalwave-bluemarine2-services-stoppingdown/1.1-ALPHA-2-SNAPSHOT/it-tidalwave-bluemarine2-services-stoppingdown-1.1-ALPHA-2-SNAPSHOT.jar
[INFO] Installing /var/jenkins_home/jobs/blueMarine2_Build_and_Quick_Test/workspace/modules/Services/StoppingDown/pom.xml to /var/jenkins_home/maven-repositories/0/it/tidalwave/bluemarine2/it-tidalwave-bluemarine2-services-stoppingdown/1.1-ALPHA-2-SNAPSHOT/it-tidalwave-bluemarine2-services-stoppingdown-1.1-ALPHA-2-SNAPSHOT.pom
[INFO] Installing /var/jenkins_home/jobs/blueMarine2_Build_and_Quick_Test/workspace/modules/Services/StoppingDown/target/it-tidalwave-bluemarine2-services-stoppingdown-1.1-ALPHA-2-SNAPSHOT.776aa35dcaa1-tests.jar to /var/jenkins_home/maven-repositories/0/it/tidalwave/bluemarine2/it-tidalwave-bluemarine2-services-stoppingdown/1.1-ALPHA-2-SNAPSHOT/it-tidalwave-bluemarine2-services-stoppingdown-1.1-ALPHA-2-SNAPSHOT-tests.jar
[JENKINS] Archiving disabled
Started calculate disk usage of build
Finished Calculation of disk usage of build in 0 seconds
Started calculate disk usage of workspace
Finished Calculation of disk usage of workspace in 0 seconds
[INFO] 
[INFO] --< it.tidalwave.bluemarine2:it-tidalwave-bluemarine2-headlessservice >--
[INFO] Building blueMarine II :: Headless Service 1.1-ALPHA-2-SNAPSHOT  [24/26]
[INFO] --------------------------------[ jar ]---------------------------------
[INFO] 
[INFO] --- maven-clean-plugin:3.1.0:clean (default-clean) @ it-tidalwave-bluemarine2-headlessservice ---
[INFO] 
[INFO] --- buildnumber-maven-plugin:1.4:create (default) @ it-tidalwave-bluemarine2-headlessservice ---
[INFO] ShortRevision tag detected. The value is '12'.
[INFO] Executing: /bin/sh -c cd '/var/jenkins_home/jobs/blueMarine2_Build_and_Quick_Test/workspace/modules/HeadlessService' && 'git' 'rev-parse' '--verify' '--short=12' 'HEAD'
[INFO] Working directory: /var/jenkins_home/jobs/blueMarine2_Build_and_Quick_Test/workspace/modules/HeadlessService
[INFO] Storing buildNumber: 776aa35dcaa1 at timestamp: 1674843183104
[WARNING] Cannot get the branch information from the git repository: 
Detecting the current branch failed: fatal: ref HEAD is not a symbolic ref

[INFO] ShortRevision tag detected. The value is '12'.
[INFO] Executing: /bin/sh -c cd '/var/jenkins_home/jobs/blueMarine2_Build_and_Quick_Test/workspace/modules/HeadlessService' && 'git' 'rev-parse' '--verify' '--short=12' 'HEAD'
[INFO] Working directory: /var/jenkins_home/jobs/blueMarine2_Build_and_Quick_Test/workspace/modules/HeadlessService
[INFO] Storing buildScmBranch: UNKNOWN
[INFO] 
[INFO] --- maven-enforcer-plugin:3.0.0-M3:enforce (enforce-maven) @ it-tidalwave-bluemarine2-headlessservice ---
[INFO] 
[INFO] --- maven-enforcer-plugin:3.0.0-M3:enforce (enforce-banned-dependencies) @ it-tidalwave-bluemarine2-headlessservice ---
[INFO] 
[INFO] --- maven-antrun-plugin:3.0.0:run (generate-and-print-build-description) @ it-tidalwave-bluemarine2-headlessservice ---
[INFO] Executing tasks
[INFO]      [echo] DESCRIPTION: origin/fabrizio.giudici 1.1-ALPHA-2-SNAPSHOT 776aa35dcaa1
[INFO]      [echo] Java Version: 11.0.10 -source 11 -target 11 -release 11
[INFO] Executed tasks
[INFO] 
[INFO] --- maven-antrun-plugin:3.0.0:run (create-unwoven-classes-dirs) @ it-tidalwave-bluemarine2-headlessservice ---
[INFO] Executing tasks
[INFO]     [mkdir] Created dir: /var/jenkins_home/jobs/blueMarine2_Build_and_Quick_Test/workspace/modules/HeadlessService/target/unwoven-classes
[INFO]     [mkdir] Created dir: /var/jenkins_home/jobs/blueMarine2_Build_and_Quick_Test/workspace/modules/HeadlessService/target/unwoven-test-classes
[INFO] Executed tasks
[INFO] 
[INFO] --- maven-resources-plugin:3.2.0:resources (default-resources) @ it-tidalwave-bluemarine2-headlessservice ---
[INFO] Using 'UTF-8' encoding to copy filtered resources.
[INFO] Using 'UTF-8' encoding to copy filtered properties files.
[INFO] Copying 1 resource
[INFO] 
[INFO] --- maven-compiler-plugin:3.8.1:compile (default-compile) @ it-tidalwave-bluemarine2-headlessservice ---
[INFO] Changes detected - recompiling the module!
[INFO] Compiling 2 source files to /var/jenkins_home/jobs/blueMarine2_Build_and_Quick_Test/workspace/modules/HeadlessService/target/unwoven-classes
[WARNING] No processor claimed any of these annotations: /javax.annotation.Nonnull
[INFO] 
[INFO] --- aspectj-maven-plugin:1.11:compile (weave-classes) @ it-tidalwave-bluemarine2-headlessservice ---
[INFO] Showing AJC message detail for messages of types: [error, warning, fail]
[INFO] 
[INFO] --- maven-resources-plugin:3.2.0:testResources (default-testResources) @ it-tidalwave-bluemarine2-headlessservice ---
[INFO] Using 'UTF-8' encoding to copy filtered resources.
[INFO] Using 'UTF-8' encoding to copy filtered properties files.
[INFO] skip non existing resourceDirectory /var/jenkins_home/jobs/blueMarine2_Build_and_Quick_Test/workspace/modules/HeadlessService/src/test/resources
[INFO] 
[INFO] --- maven-compiler-plugin:3.8.1:testCompile (default-testCompile) @ it-tidalwave-bluemarine2-headlessservice ---
[INFO] No sources to compile
[INFO] 
[INFO] --- aspectj-maven-plugin:1.11:test-compile (weave-test-classes) @ it-tidalwave-bluemarine2-headlessservice ---
[INFO] Showing AJC message detail for messages of types: [error, warning, fail]
[INFO] 
[INFO] --- maven-surefire-plugin:3.0.0-M5:test (default-test) @ it-tidalwave-bluemarine2-headlessservice ---
[JENKINS] Recording test results
[INFO] 
[INFO] --- maven-jar-plugin:3.2.0:jar (default-jar) @ it-tidalwave-bluemarine2-headlessservice ---
[INFO] Building jar: /var/jenkins_home/jobs/blueMarine2_Build_and_Quick_Test/workspace/modules/HeadlessService/target/it-tidalwave-bluemarine2-headlessservice-1.1-ALPHA-2-SNAPSHOT.776aa35dcaa1.jar
[INFO] 
[INFO] --- maven-jar-plugin:3.2.0:test-jar (default-test-jar) @ it-tidalwave-bluemarine2-headlessservice ---
[INFO] Building jar: /var/jenkins_home/jobs/blueMarine2_Build_and_Quick_Test/workspace/modules/HeadlessService/target/it-tidalwave-bluemarine2-headlessservice-1.1-ALPHA-2-SNAPSHOT.776aa35dcaa1-tests.jar
[INFO] 
[INFO] --- maven-install-plugin:3.0.0-M1:install (default-install) @ it-tidalwave-bluemarine2-headlessservice ---
[INFO] Installing /var/jenkins_home/jobs/blueMarine2_Build_and_Quick_Test/workspace/modules/HeadlessService/target/it-tidalwave-bluemarine2-headlessservice-1.1-ALPHA-2-SNAPSHOT.776aa35dcaa1.jar to /var/jenkins_home/maven-repositories/0/it/tidalwave/bluemarine2/it-tidalwave-bluemarine2-headlessservice/1.1-ALPHA-2-SNAPSHOT/it-tidalwave-bluemarine2-headlessservice-1.1-ALPHA-2-SNAPSHOT.jar
[INFO] Installing /var/jenkins_home/jobs/blueMarine2_Build_and_Quick_Test/workspace/modules/HeadlessService/pom.xml to /var/jenkins_home/maven-repositories/0/it/tidalwave/bluemarine2/it-tidalwave-bluemarine2-headlessservice/1.1-ALPHA-2-SNAPSHOT/it-tidalwave-bluemarine2-headlessservice-1.1-ALPHA-2-SNAPSHOT.pom
[INFO] Installing /var/jenkins_home/jobs/blueMarine2_Build_and_Quick_Test/workspace/modules/HeadlessService/target/it-tidalwave-bluemarine2-headlessservice-1.1-ALPHA-2-SNAPSHOT.776aa35dcaa1-tests.jar to /var/jenkins_home/maven-repositories/0/it/tidalwave/bluemarine2/it-tidalwave-bluemarine2-headlessservice/1.1-ALPHA-2-SNAPSHOT/it-tidalwave-bluemarine2-headlessservice-1.1-ALPHA-2-SNAPSHOT-tests.jar
[JENKINS] Archiving disabled
Started calculate disk usage of build
Finished Calculation of disk usage of build in 0 seconds
Started calculate disk usage of workspace
Finished Calculation of disk usage of workspace in 0 seconds
[INFO] 
[INFO] --< it.tidalwave.bluemarine2:it-tidalwave-bluemarine2-application-javafx >--
[INFO] Building blueMarine II :: Application :: JavaFX 1.1-ALPHA-2-SNAPSHOT [25/26]
[INFO] --------------------------------[ jar ]---------------------------------
[INFO] 
[INFO] --- maven-clean-plugin:3.1.0:clean (default-clean) @ it-tidalwave-bluemarine2-application-javafx ---
[INFO] 
[INFO] --- buildnumber-maven-plugin:1.4:create (default) @ it-tidalwave-bluemarine2-application-javafx ---
[INFO] ShortRevision tag detected. The value is '12'.
[INFO] Executing: /bin/sh -c cd '/var/jenkins_home/jobs/blueMarine2_Build_and_Quick_Test/workspace/modules/JavaFXApplication' && 'git' 'rev-parse' '--verify' '--short=12' 'HEAD'
[INFO] Working directory: /var/jenkins_home/jobs/blueMarine2_Build_and_Quick_Test/workspace/modules/JavaFXApplication
[INFO] Storing buildNumber: 776aa35dcaa1 at timestamp: 1674843191286
[WARNING] Cannot get the branch information from the git repository: 
Detecting the current branch failed: fatal: ref HEAD is not a symbolic ref

[INFO] ShortRevision tag detected. The value is '12'.
[INFO] Executing: /bin/sh -c cd '/var/jenkins_home/jobs/blueMarine2_Build_and_Quick_Test/workspace/modules/JavaFXApplication' && 'git' 'rev-parse' '--verify' '--short=12' 'HEAD'
[INFO] Working directory: /var/jenkins_home/jobs/blueMarine2_Build_and_Quick_Test/workspace/modules/JavaFXApplication
[INFO] Storing buildScmBranch: UNKNOWN
[INFO] 
[INFO] --- maven-enforcer-plugin:3.0.0-M3:enforce (enforce-maven) @ it-tidalwave-bluemarine2-application-javafx ---
[INFO] 
[INFO] --- maven-enforcer-plugin:3.0.0-M3:enforce (enforce-banned-dependencies) @ it-tidalwave-bluemarine2-application-javafx ---
[INFO] 
[INFO] --- maven-antrun-plugin:3.0.0:run (generate-and-print-build-description) @ it-tidalwave-bluemarine2-application-javafx ---
[INFO] Executing tasks
[INFO]      [echo] DESCRIPTION: origin/fabrizio.giudici 1.1-ALPHA-2-SNAPSHOT 776aa35dcaa1
[INFO]      [echo] Java Version: 11.0.10 -source 11 -target 11 -release 11
[INFO] Executed tasks
[INFO] 
[INFO] --- maven-antrun-plugin:3.0.0:run (create-unwoven-classes-dirs) @ it-tidalwave-bluemarine2-application-javafx ---
[INFO] Executing tasks
[INFO]     [mkdir] Created dir: /var/jenkins_home/jobs/blueMarine2_Build_and_Quick_Test/workspace/modules/JavaFXApplication/target/unwoven-classes
[INFO]     [mkdir] Created dir: /var/jenkins_home/jobs/blueMarine2_Build_and_Quick_Test/workspace/modules/JavaFXApplication/target/unwoven-test-classes
[INFO] Executed tasks
[INFO] 
[INFO] --- maven-resources-plugin:3.2.0:resources (default-resources) @ it-tidalwave-bluemarine2-application-javafx ---
[INFO] Using 'UTF-8' encoding to copy filtered resources.
[INFO] Using 'UTF-8' encoding to copy filtered properties files.
[INFO] Copying 5 resources
[INFO] 
[INFO] --- maven-compiler-plugin:3.8.1:compile (default-compile) @ it-tidalwave-bluemarine2-application-javafx ---
[INFO] Changes detected - recompiling the module!
[INFO] Compiling 3 source files to /var/jenkins_home/jobs/blueMarine2_Build_and_Quick_Test/workspace/modules/JavaFXApplication/target/unwoven-classes
[WARNING] No processor claimed any of these annotations: /javax.annotation.Nonnull,/javafx.fxml.FXML,java.base/java.lang.Override,/javax.inject.Inject
[INFO] 
[INFO] --- aspectj-maven-plugin:1.11:compile (weave-classes) @ it-tidalwave-bluemarine2-application-javafx ---
[INFO] Showing AJC message detail for messages of types: [error, warning, fail]
[INFO] 
[INFO] --- maven-resources-plugin:3.2.0:testResources (default-testResources) @ it-tidalwave-bluemarine2-application-javafx ---
[INFO] Using 'UTF-8' encoding to copy filtered resources.
[INFO] Using 'UTF-8' encoding to copy filtered properties files.
[INFO] skip non existing resourceDirectory /var/jenkins_home/jobs/blueMarine2_Build_and_Quick_Test/workspace/modules/JavaFXApplication/src/test/resources
[INFO] 
[INFO] --- maven-compiler-plugin:3.8.1:testCompile (default-testCompile) @ it-tidalwave-bluemarine2-application-javafx ---
[INFO] No sources to compile
[INFO] 
[INFO] --- aspectj-maven-plugin:1.11:test-compile (weave-test-classes) @ it-tidalwave-bluemarine2-application-javafx ---
[INFO] Showing AJC message detail for messages of types: [error, warning, fail]
[INFO] 
[INFO] --- maven-surefire-plugin:3.0.0-M5:test (default-test) @ it-tidalwave-bluemarine2-application-javafx ---
[JENKINS] Recording test results
[INFO] 
[INFO] --- maven-jar-plugin:3.2.0:jar (default-jar) @ it-tidalwave-bluemarine2-application-javafx ---
[INFO] Building jar: /var/jenkins_home/jobs/blueMarine2_Build_and_Quick_Test/workspace/modules/JavaFXApplication/target/it-tidalwave-bluemarine2-application-javafx-1.1-ALPHA-2-SNAPSHOT.776aa35dcaa1.jar
[INFO] 
[INFO] --- maven-jar-plugin:3.2.0:test-jar (default-test-jar) @ it-tidalwave-bluemarine2-application-javafx ---
[INFO] Building jar: /var/jenkins_home/jobs/blueMarine2_Build_and_Quick_Test/workspace/modules/JavaFXApplication/target/it-tidalwave-bluemarine2-application-javafx-1.1-ALPHA-2-SNAPSHOT.776aa35dcaa1-tests.jar
[INFO] 
[INFO] --- maven-install-plugin:3.0.0-M1:install (default-install) @ it-tidalwave-bluemarine2-application-javafx ---
[INFO] Installing /var/jenkins_home/jobs/blueMarine2_Build_and_Quick_Test/workspace/modules/JavaFXApplication/target/it-tidalwave-bluemarine2-application-javafx-1.1-ALPHA-2-SNAPSHOT.776aa35dcaa1.jar to /var/jenkins_home/maven-repositories/0/it/tidalwave/bluemarine2/it-tidalwave-bluemarine2-application-javafx/1.1-ALPHA-2-SNAPSHOT/it-tidalwave-bluemarine2-application-javafx-1.1-ALPHA-2-SNAPSHOT.jar
[INFO] Installing /var/jenkins_home/jobs/blueMarine2_Build_and_Quick_Test/workspace/modules/JavaFXApplication/pom.xml to /var/jenkins_home/maven-repositories/0/it/tidalwave/bluemarine2/it-tidalwave-bluemarine2-application-javafx/1.1-ALPHA-2-SNAPSHOT/it-tidalwave-bluemarine2-application-javafx-1.1-ALPHA-2-SNAPSHOT.pom
[INFO] Installing /var/jenkins_home/jobs/blueMarine2_Build_and_Quick_Test/workspace/modules/JavaFXApplication/target/it-tidalwave-bluemarine2-application-javafx-1.1-ALPHA-2-SNAPSHOT.776aa35dcaa1-tests.jar to /var/jenkins_home/maven-repositories/0/it/tidalwave/bluemarine2/it-tidalwave-bluemarine2-application-javafx/1.1-ALPHA-2-SNAPSHOT/it-tidalwave-bluemarine2-application-javafx-1.1-ALPHA-2-SNAPSHOT-tests.jar
[JENKINS] Archiving disabled
Started calculate disk usage of build
Finished Calculation of disk usage of build in 0 seconds
Started calculate disk usage of workspace
Finished Calculation of disk usage of workspace in 0 seconds
[INFO] 
[INFO] --------< it.tidalwave.bluemarine2:bluemarine2-plugins-modules >--------
[INFO] Building blueMarine II :: Plugins (modules) 1.1-ALPHA-2-SNAPSHOT [26/26]
[INFO] --------------------------------[ pom ]---------------------------------
[INFO] 
[INFO] --- maven-clean-plugin:3.1.0:clean (default-clean) @ bluemarine2-plugins-modules ---
[INFO] 
[INFO] --- buildnumber-maven-plugin:1.4:create (default) @ bluemarine2-plugins-modules ---
[INFO] ShortRevision tag detected. The value is '12'.
[INFO] Executing: /bin/sh -c cd '/var/jenkins_home/jobs/blueMarine2_Build_and_Quick_Test/workspace/modules/Plugins' && 'git' 'rev-parse' '--verify' '--short=12' 'HEAD'
[INFO] Working directory: /var/jenkins_home/jobs/blueMarine2_Build_and_Quick_Test/workspace/modules/Plugins
[INFO] Storing buildNumber: 776aa35dcaa1 at timestamp: 1674843200951
[WARNING] Cannot get the branch information from the git repository: 
Detecting the current branch failed: fatal: ref HEAD is not a symbolic ref

[INFO] ShortRevision tag detected. The value is '12'.
[INFO] Executing: /bin/sh -c cd '/var/jenkins_home/jobs/blueMarine2_Build_and_Quick_Test/workspace/modules/Plugins' && 'git' 'rev-parse' '--verify' '--short=12' 'HEAD'
[INFO] Working directory: /var/jenkins_home/jobs/blueMarine2_Build_and_Quick_Test/workspace/modules/Plugins
[INFO] Storing buildScmBranch: UNKNOWN
[INFO] 
[INFO] --- maven-enforcer-plugin:3.0.0-M3:enforce (enforce-maven) @ bluemarine2-plugins-modules ---
[INFO] 
[INFO] --- maven-enforcer-plugin:3.0.0-M3:enforce (enforce-banned-dependencies) @ bluemarine2-plugins-modules ---
[INFO] 
[INFO] --- maven-antrun-plugin:3.0.0:run (generate-and-print-build-description) @ bluemarine2-plugins-modules ---
[INFO] Executing tasks
[INFO]      [echo] DESCRIPTION: origin/fabrizio.giudici 1.1-ALPHA-2-SNAPSHOT 776aa35dcaa1
[INFO]      [echo] Java Version: 11.0.10 -source 11 -target 11 -release 11
[INFO] Executed tasks
[INFO] 
[INFO] --- maven-jar-plugin:3.2.0:test-jar (default-test-jar) @ bluemarine2-plugins-modules ---
[INFO] Skipping packaging of the test-jar
[INFO] 
[INFO] --- maven-install-plugin:3.0.0-M1:install (default-install) @ bluemarine2-plugins-modules ---
[INFO] Installing /var/jenkins_home/jobs/blueMarine2_Build_and_Quick_Test/workspace/modules/Plugins/pom.xml to /var/jenkins_home/maven-repositories/0/it/tidalwave/bluemarine2/bluemarine2-plugins-modules/1.1-ALPHA-2-SNAPSHOT/bluemarine2-plugins-modules-1.1-ALPHA-2-SNAPSHOT.pom
[JENKINS] Archiving disabled
Started calculate disk usage of build
Finished Calculation of disk usage of build in 0 seconds
Started calculate disk usage of workspace
Finished Calculation of disk usage of workspace in 0 seconds
[JENKINS] Archiving disabled
[JENKINS] Archiving disabled
[JENKINS] Archiving disabled
[JENKINS] Archiving disabled
[JENKINS] Archiving disabled
[JENKINS] Archiving disabled
[JENKINS] Archiving disabled
[JENKINS] Archiving disabled
[JENKINS] Archiving disabled
[JENKINS] Archiving disabled
[JENKINS] Archiving disabled
[JENKINS] Archiving disabled
[JENKINS] Archiving disabled
[JENKINS] Archiving disabled
[JENKINS] Archiving disabled
[JENKINS] Archiving disabled
[JENKINS] Archiving disabled
[JENKINS] Archiving disabled
[JENKINS] Archiving disabled
[JENKINS] Archiving disabled
[JENKINS] Archiving disabled
[JENKINS] Archiving disabled
[JENKINS] Archiving disabled
[JENKINS] Archiving disabled
[JENKINS] Archiving disabled
[INFO] ------------------------------------------------------------------------
[INFO] Reactor Summary for blueMarine II 1.1-ALPHA-2-SNAPSHOT:
[INFO] 
[INFO] blueMarine II ...................................... SUCCESS [  6.449 s]
[INFO] blueMarine II (modules) ............................ SUCCESS [  9.667 s]
[INFO] blueMarine II :: Commons ........................... SUCCESS [ 50.146 s]
[INFO] blueMarine II :: Capture One 11 Applescript ........ SUCCESS [ 18.732 s]
[INFO] blueMarine II :: Commons for Tests ................. SUCCESS [ 12.091 s]
[INFO] blueMarine II :: Model ............................. SUCCESS [01:33 min]
[INFO] blueMarine II :: Persistence ....................... SUCCESS [ 58.996 s]
[INFO] blueMarine II :: Vocabulary ........................ SUCCESS [  9.037 s]
[INFO] blueMarine II :: MusicBrainz :: Data Model ......... SUCCESS [ 16.081 s]
[INFO] blueMarine II :: MusicBrainz ....................... SUCCESS [02:42 min]
[INFO] blueMarine II :: Media Scanner ..................... SUCCESS [ 25.283 s]
[INFO] blueMarine II :: Catalog ........................... SUCCESS [ 34.944 s]
[INFO] blueMarine II :: Downloader ........................ SUCCESS [ 31.767 s]
[INFO] blueMarine II :: UI ................................ SUCCESS [ 12.657 s]
[INFO] blueMarine II :: UI :: JavaFX ...................... SUCCESS [ 12.042 s]
[INFO] blueMarine II :: CEC :: Adapter .................... SUCCESS [  9.672 s]
[INFO] blueMarine II :: CEC :: Navigation Adapter ......... SUCCESS [  8.532 s]
[INFO] blueMarine II :: Media Server ...................... SUCCESS [ 27.139 s]
[INFO] blueMarine II :: Media Server :: REST .............. SUCCESS [ 42.358 s]
[INFO] blueMarine II :: Media Server :: UPnP .............. SUCCESS [ 49.396 s]
[INFO] blueMarine II :: Initializer ....................... SUCCESS [  7.426 s]
[INFO] blueMarine II :: Services (modules) ................ SUCCESS [  0.582 s]
[INFO] blueMarine II :: Services :: StoppingDown .......... SUCCESS [ 27.065 s]
[INFO] blueMarine II :: Headless Service .................. SUCCESS [  7.499 s]
[INFO] blueMarine II :: Application :: JavaFX ............. SUCCESS [  8.851 s]
[INFO] blueMarine II :: Plugins (modules) ................. SUCCESS [  0.433 s]
[INFO] ------------------------------------------------------------------------
[INFO] BUILD SUCCESS
[INFO] ------------------------------------------------------------------------
[INFO] Total time:  12:50 min
[INFO] Finished at: 2023-01-27T18:13:24Z
[INFO] ------------------------------------------------------------------------
[JENKINS] Archiving disabled
channel stopped
TestNG Reports Processing: START
Looking for TestNG results report in workspace using pattern: **/target/**/testng-results.xml
Saving reports...
Processing '/var/jenkins_home/jobs/blueMarine2_Build_and_Quick_Test/builds/164/testng/testng-results-1.xml'
Processing '/var/jenkins_home/jobs/blueMarine2_Build_and_Quick_Test/builds/164/testng/testng-results-10.xml'
Processing '/var/jenkins_home/jobs/blueMarine2_Build_and_Quick_Test/builds/164/testng/testng-results-11.xml'
Processing '/var/jenkins_home/jobs/blueMarine2_Build_and_Quick_Test/builds/164/testng/testng-results-2.xml'
Processing '/var/jenkins_home/jobs/blueMarine2_Build_and_Quick_Test/builds/164/testng/testng-results-3.xml'
Processing '/var/jenkins_home/jobs/blueMarine2_Build_and_Quick_Test/builds/164/testng/testng-results-4.xml'
Processing '/var/jenkins_home/jobs/blueMarine2_Build_and_Quick_Test/builds/164/testng/testng-results-5.xml'
Processing '/var/jenkins_home/jobs/blueMarine2_Build_and_Quick_Test/builds/164/testng/testng-results-6.xml'
Processing '/var/jenkins_home/jobs/blueMarine2_Build_and_Quick_Test/builds/164/testng/testng-results-7.xml'
Processing '/var/jenkins_home/jobs/blueMarine2_Build_and_Quick_Test/builds/164/testng/testng-results-8.xml'
Processing '/var/jenkins_home/jobs/blueMarine2_Build_and_Quick_Test/builds/164/testng/testng-results-9.xml'
Processing '/var/jenkins_home/jobs/blueMarine2_Build_and_Quick_Test/builds/164/testng/testng-results.xml'
TestNG Reports Processing: FINISH
[description-setter] Description set: origin/fabrizio.giudici 1.1-ALPHA-2-SNAPSHOT 776aa35dcaa1
Started calculate disk usage of build
Finished Calculation of disk usage of build in 0 seconds
Started calculate disk usage of workspace
Finished Calculation of disk usage of workspace in 0 seconds
Finished: UNSTABLE