Details

    • Type: Defect (bug)
    • Status: Closed
    • Priority: Critical
    • Resolution: Fixed
    • Affects Version/s: None
    • Fix Version/s: 1.1-ALPHA-35
    • Component/s: None
    • Labels:
      None

      Description

      When compiling with a clean local maven repo:

      [INFO] NorthernWind - Frontend Webapp (Spring MVC) ........ SUCCESS [ 2.546 s]
      [INFO] NorthernWind - Media Frontend Webapp (Spring MVC) .. FAILURE [ 0.049 s]
      [INFO] NorthernWind - Frontend Webapp (Vaadin) ............ SKIPPED
      [INFO] ------------------------------------------------------------------------
      [INFO] BUILD FAILURE
      [INFO] ------------------------------------------------------------------------
      [INFO] Total time: 01:10 min
      [INFO] Finished at: 2015-12-17T19:27:15+01:00
      [INFO] Final Memory: 52M/414M
      [INFO] ------------------------------------------------------------------------
      [ERROR] Failed to execute goal on project it-tidalwave-northernwind-frontend-media-springmvc-webapp: Could not resolve dependencies for project it.tidalwave.northernwind:it-tidalwave-northernwind-frontend-media-springmvc-webapp:war:1.1-ALPHA-35-SNAPSHOT: Cannot access maven-proxy.tidalwave.it (http://services.tidalwave.it/nexus/content/groups/public) in offline mode and the artifact it.tidalwave.northernwind:it-tidalwave-northernwind-frontend-media-springmvc:jar:1.1-ALPHA-35-SNAPSHOT has not been downloaded from it before. -> [Help 1]

        Activity

        There are no comments yet on this issue.

          People

          • Assignee:
            fabrizio.giudici Fabrizio Giudici
            Reporter:
            fabrizio.giudici Fabrizio Giudici
          • Votes:
            0 Vote for this issue
            Watchers:
            1 Start watching this issue

            Dates

            • Created:
              Updated:
              Resolved: