FailedConsole Output

Skipping 16,229 KB.. Full Log
  required: Collection<? extends E>
  found:    List
  where E is a type-variable:
    E extends Object declared in class CopyOnWriteArrayList
[WARNING] /var/jenkins_home/jobs/blueMarine2_Metrics_OpenJDK_17/workspace/modules/Model/src/main/java/it/tidalwave/bluemarine2/model/impl/PathAwareEntityFinderDelegate.java:[152,61] [unchecked] unchecked conversion
  required: Collection<? extends E>
  found:    List
  where E is a type-variable:
    E extends Object declared in class CopyOnWriteArrayList
[WARNING] /var/jenkins_home/jobs/blueMarine2_Metrics_OpenJDK_17/workspace/modules/Model/src/main/java/it/tidalwave/bluemarine2/model/impl/PathAwareEntityFinderDelegate.java:[151,15] [unchecked] unchecked conversion
  required: List<? extends PathAwareEntity>
  found:    CopyOnWriteArrayList
[WARNING] /var/jenkins_home/jobs/blueMarine2_Metrics_OpenJDK_17/workspace/modules/Model/src/main/java/it/tidalwave/bluemarine2/model/impl/PathAwareEntityFinderDelegate.java:[207,60] [unchecked] unchecked cast
  required: Optional<PathAwareEntity>
  found:    Optional<CAP#1>
  where CAP#1 is a fresh type-variable:
    CAP#1 extends PathAwareEntity from capture of ? extends PathAwareEntity
[WARNING] /var/jenkins_home/jobs/blueMarine2_Metrics_OpenJDK_17/workspace/modules/Model/src/main/java/it/tidalwave/bluemarine2/model/impl/PathAwareEntityFinderDelegate.java:[230,19] [rawtypes] found raw type: SimpleComposite
  missing type arguments for generic class SimpleComposite<TYPE>
  where TYPE is a type-variable:
    TYPE extends Object declared in interface SimpleComposite
[WARNING] /var/jenkins_home/jobs/blueMarine2_Metrics_OpenJDK_17/workspace/modules/Model/src/main/java/it/tidalwave/bluemarine2/model/spi/MetadataSupport.java:[79,82] [unchecked] unchecked cast
  required: T
  found:    Object
  where T is a type-variable:
    T extends Object declared in method <T>get(Key<T>)
[WARNING] /var/jenkins_home/jobs/blueMarine2_Metrics_OpenJDK_17/workspace/modules/Model/src/main/java/it/tidalwave/bluemarine2/model/spi/MetadataSupport.java:[91,40] [unchecked] unchecked cast
  required: T
  found:    Object
  where T is a type-variable:
    T extends Object declared in method <T>getAll(Key<T>)
[WARNING] /var/jenkins_home/jobs/blueMarine2_Metrics_OpenJDK_17/workspace/modules/Model/src/main/java/it/tidalwave/bluemarine2/model/spi/MetadataSupport.java:[93,94] [unchecked] unchecked cast
  required: T
  found:    List<Object>
  where T is a type-variable:
    T extends Object declared in method <T>getAll(Key<T>)
[INFO] 
[INFO] --- aspectj-maven-plugin:1.11:compile (weave-classes) @ it-tidalwave-bluemarine2-model ---
[INFO] Showing AJC message detail for messages of types: [error, warning, fail]
[INFO] 
[INFO] --- maven-dependency-plugin:3.1.2:unpack (default) @ it-tidalwave-bluemarine2-model ---
[INFO] Configured Artifact: it.tidalwave.bluemarine2.testsets:expected-metadata-iTunes-fg-20160504-2:5:zip
[INFO] Configured Artifact: it.tidalwave.bluemarine2.testsets:expected-metadata-iTunes-fg-20161210-1:2:zip
[INFO] Configured Artifact: it.tidalwave.bluemarine2.testsets:expected-metadata-iTunes-aac-fg-20170131-1:3:zip
[INFO] Configured Artifact: it.tidalwave.bluemarine2.testsets:expected-metadata-amazon-autorip-fg-20170131-1:3:zip
[INFO] Unpacking /var/jenkins_home/jobs/blueMarine2_Metrics_OpenJDK_17/workspace@tmp/repository/it/tidalwave/bluemarine2/testsets/expected-metadata-iTunes-fg-20160504-2/5/expected-metadata-iTunes-fg-20160504-2-5.zip to /var/jenkins_home/jobs/blueMarine2_Metrics_OpenJDK_17/workspace/modules/Model/target/test-classes/expected-results/metadata with includes "" and excludes ""
[INFO] Unpacking /var/jenkins_home/jobs/blueMarine2_Metrics_OpenJDK_17/workspace@tmp/repository/it/tidalwave/bluemarine2/testsets/expected-metadata-iTunes-fg-20161210-1/2/expected-metadata-iTunes-fg-20161210-1-2.zip to /var/jenkins_home/jobs/blueMarine2_Metrics_OpenJDK_17/workspace/modules/Model/target/test-classes/expected-results/metadata with includes "" and excludes ""
[INFO] Unpacking /var/jenkins_home/jobs/blueMarine2_Metrics_OpenJDK_17/workspace@tmp/repository/it/tidalwave/bluemarine2/testsets/expected-metadata-iTunes-aac-fg-20170131-1/3/expected-metadata-iTunes-aac-fg-20170131-1-3.zip to /var/jenkins_home/jobs/blueMarine2_Metrics_OpenJDK_17/workspace/modules/Model/target/test-classes/expected-results/metadata with includes "" and excludes ""
[INFO] Unpacking /var/jenkins_home/jobs/blueMarine2_Metrics_OpenJDK_17/workspace@tmp/repository/it/tidalwave/bluemarine2/testsets/expected-metadata-amazon-autorip-fg-20170131-1/3/expected-metadata-amazon-autorip-fg-20170131-1-3.zip to /var/jenkins_home/jobs/blueMarine2_Metrics_OpenJDK_17/workspace/modules/Model/target/test-classes/expected-results/metadata with includes "" and excludes ""
[INFO] 
[INFO] --- maven-resources-plugin:3.2.0:testResources (default-testResources) @ it-tidalwave-bluemarine2-model ---
[INFO] Using 'UTF-8' encoding to copy filtered resources.
[INFO] Using 'UTF-8' encoding to copy filtered properties files.
[INFO] Copying 1 resource
[INFO] 
[INFO] --- maven-compiler-plugin:3.8.1:testCompile (default-testCompile) @ it-tidalwave-bluemarine2-model ---
[INFO] Changes detected - recompiling the module!
[INFO] Compiling 4 source files to /var/jenkins_home/jobs/blueMarine2_Metrics_OpenJDK_17/workspace/modules/Model/target/unwoven-test-classes
[WARNING] No processor claimed any of these annotations: /javax.annotation.Nonnull,/org.testng.annotations.BeforeMethod,/org.testng.annotations.Test,/org.testng.annotations.DataProvider
[WARNING] Failed to getClass for org.apache.maven.plugins.dependency.analyze.AnalyzeMojo
[INFO] 
[INFO] <<< maven-dependency-plugin:3.1.2:analyze (default-cli) < test-compile @ it-tidalwave-bluemarine2-model <<<
[INFO] 
[INFO] 
[INFO] --- maven-dependency-plugin:3.1.2:analyze (default-cli) @ it-tidalwave-bluemarine2-model ---
[WARNING] Used undeclared dependencies found:
[WARNING]    com.google.code.findbugs:jsr305:jar:3.0.2:compile
[WARNING]    org.springframework:spring-core:jar:5.3.1:compile
[WARNING]    com.github.spotbugs:spotbugs-annotations:jar:3.1.9:compile
[WARNING]    org.hamcrest:hamcrest-core:jar:1.3:test
[WARNING]    org.openjfx:javafx-base:jar:linux:11.0.1:provided
[WARNING] Unused declared dependencies found:
[WARNING]    org.springframework:spring-aspects:jar:5.3.1:compile
[WARNING]    org.openjfx:javafx-base:jar:11.0.1:provided
[WARNING]    javax.inject:javax.inject:jar:1:compile
[WARNING]    org.projectlombok:lombok:jar:1.18.22:provided
[WARNING]    org.slf4j:jcl-over-slf4j:jar:1.7.30:runtime
[WARNING]    org.slf4j:jul-to-slf4j:jar:1.7.30:runtime
[WARNING]    ch.qos.logback:logback-classic:jar:1.2.3:runtime
[WARNING]    it.tidalwave.thesefoolishthings:it-tidalwave-util-test:jar:3.2-ALPHA-11:test
[WARNING]    org.hamcrest:hamcrest-all:jar:1.3:test
[WARNING]    org.aspectj:aspectjrt:jar:1.9.6:compile
[JENKINS] Archiving disabled
Started calculate disk usage of build
Finished Calculation of disk usage of build in 0 seconds
Started calculate disk usage of workspace
Finished Calculation of disk usage of workspace in 0 seconds
[INFO] 
[INFO] ---< it.tidalwave.bluemarine2:it-tidalwave-bluemarine2-persistence >----
[INFO] Building blueMarine II :: Persistence 1.1-ALPHA-2-SNAPSHOT        [7/26]
[INFO] --------------------------------[ jar ]---------------------------------
[INFO] 
[INFO] --- maven-clean-plugin:3.1.0:clean (default-clean) @ it-tidalwave-bluemarine2-persistence ---
[INFO] 
[INFO] --- buildnumber-maven-plugin:1.4:create (default) @ it-tidalwave-bluemarine2-persistence ---
[INFO] ShortRevision tag detected. The value is '12'.
[INFO] Executing: /bin/sh -c cd '/var/jenkins_home/jobs/blueMarine2_Metrics_OpenJDK_17/workspace/modules/Persistence' && 'git' 'rev-parse' '--verify' '--short=12' 'HEAD'
[INFO] Working directory: /var/jenkins_home/jobs/blueMarine2_Metrics_OpenJDK_17/workspace/modules/Persistence
[INFO] Storing buildNumber: 5bd725d04573 at timestamp: 1659932205963
[WARNING] Cannot get the branch information from the git repository: 
Detecting the current branch failed: fatal: ref HEAD is not a symbolic ref

[INFO] ShortRevision tag detected. The value is '12'.
[INFO] Executing: /bin/sh -c cd '/var/jenkins_home/jobs/blueMarine2_Metrics_OpenJDK_17/workspace/modules/Persistence' && 'git' 'rev-parse' '--verify' '--short=12' 'HEAD'
[INFO] Working directory: /var/jenkins_home/jobs/blueMarine2_Metrics_OpenJDK_17/workspace/modules/Persistence
[INFO] Storing buildScmBranch: UNKNOWN
[INFO] 
[INFO] --- maven-enforcer-plugin:3.0.0-M3:enforce (enforce-maven) @ it-tidalwave-bluemarine2-persistence ---
[INFO] 
[INFO] --- maven-enforcer-plugin:3.0.0-M3:enforce (enforce-banned-dependencies) @ it-tidalwave-bluemarine2-persistence ---
[INFO] 
[INFO] --- maven-antrun-plugin:3.0.0:run (generate-and-print-build-description) @ it-tidalwave-bluemarine2-persistence ---
[INFO] Executing tasks
[INFO]      [echo] DESCRIPTION: origin/master 1.1-ALPHA-2-SNAPSHOT 5bd725d04573
[INFO]      [echo] Java Version: 17.0.1 -source 11 -target 11 -release 11
[INFO] Executed tasks
[INFO] 
[INFO] --- jacoco-maven-plugin:0.8.7:prepare-agent (prepare-agent) @ it-tidalwave-bluemarine2-persistence ---
[INFO] tft.test.jacoco.argLine set to -javaagent:/var/jenkins_home/jobs/blueMarine2_Metrics_OpenJDK_17/workspace@tmp/repository/org/jacoco/org.jacoco.agent/0.8.7/org.jacoco.agent-0.8.7-runtime.jar=destfile=/var/jenkins_home/jobs/blueMarine2_Metrics_OpenJDK_17/workspace/modules/Persistence/target/jacoco.exec
[INFO] 
[INFO] --- maven-antrun-plugin:3.0.0:run (create-unwoven-classes-dirs) @ it-tidalwave-bluemarine2-persistence ---
[INFO] Executing tasks
[INFO]     [mkdir] Created dir: /var/jenkins_home/jobs/blueMarine2_Metrics_OpenJDK_17/workspace/modules/Persistence/target/unwoven-classes
[INFO]     [mkdir] Created dir: /var/jenkins_home/jobs/blueMarine2_Metrics_OpenJDK_17/workspace/modules/Persistence/target/unwoven-test-classes
[INFO] Executed tasks
[INFO] 
[INFO] --- maven-resources-plugin:3.2.0:resources (default-resources) @ it-tidalwave-bluemarine2-persistence ---
[INFO] Using 'UTF-8' encoding to copy filtered resources.
[INFO] Using 'UTF-8' encoding to copy filtered properties files.
[INFO] Copying 1 resource
[INFO] 
[INFO] --- maven-compiler-plugin:3.8.1:compile (default-compile) @ it-tidalwave-bluemarine2-persistence ---
[INFO] Changes detected - recompiling the module!
[INFO] Compiling 4 source files to /var/jenkins_home/jobs/blueMarine2_Metrics_OpenJDK_17/workspace/modules/Persistence/target/unwoven-classes
[WARNING] No processor claimed any of these annotations: /javax.annotation.Nonnull,/it.tidalwave.util.annotation.VisibleForTesting,/it.tidalwave.messagebus.annotation.ListensTo,/it.tidalwave.messagebus.annotation.SimpleMessageSubscriber,/javax.inject.Inject
[WARNING] /var/jenkins_home/jobs/blueMarine2_Metrics_OpenJDK_17/workspace/modules/Persistence/src/main/java/it/tidalwave/bluemarine2/persistence/impl/RepositoryDelegate.java:[60,16] [deprecation] initialize() in Repository has been deprecated
[WARNING] /var/jenkins_home/jobs/blueMarine2_Metrics_OpenJDK_17/workspace/modules/Persistence/src/main/java/it/tidalwave/bluemarine2/persistence/impl/DefaultPersistence.java:[128,18] [deprecation] initialize() in Repository has been deprecated
[INFO] 
[INFO] --- aspectj-maven-plugin:1.11:compile (weave-classes) @ it-tidalwave-bluemarine2-persistence ---
[INFO] Showing AJC message detail for messages of types: [error, warning, fail]
[INFO] 
[INFO] --- maven-resources-plugin:3.2.0:testResources (default-testResources) @ it-tidalwave-bluemarine2-persistence ---
[INFO] Using 'UTF-8' encoding to copy filtered resources.
[INFO] Using 'UTF-8' encoding to copy filtered properties files.
[INFO] Copying 3 resources
[INFO] 
[INFO] --- maven-compiler-plugin:3.8.1:testCompile (default-testCompile) @ it-tidalwave-bluemarine2-persistence ---
[INFO] Changes detected - recompiling the module!
[INFO] Compiling 1 source file to /var/jenkins_home/jobs/blueMarine2_Metrics_OpenJDK_17/workspace/modules/Persistence/target/unwoven-test-classes
[WARNING] No processor claimed any of these annotations: /org.testng.annotations.Test,/javax.annotation.Nonnull,/org.testng.annotations.BeforeMethod
[WARNING] /var/jenkins_home/jobs/blueMarine2_Metrics_OpenJDK_17/workspace/modules/Persistence/src/test/java/it/tidalwave/bluemarine2/persistence/impl/DefaultPersistenceTest.java:[232,18] [deprecation] initialize() in Repository has been deprecated
[INFO] 
[INFO] --- aspectj-maven-plugin:1.11:test-compile (weave-test-classes) @ it-tidalwave-bluemarine2-persistence ---
[INFO] Showing AJC message detail for messages of types: [error, warning, fail]
[INFO] 
[INFO] --- maven-surefire-plugin:3.0.0-M5:test (default-test) @ it-tidalwave-bluemarine2-persistence ---
[INFO] 
[INFO] -------------------------------------------------------
[INFO]  T E S T S
[INFO] -------------------------------------------------------
[INFO] Running it.tidalwave.bluemarine2.persistence.impl.DefaultPersistenceTest
06:17:10.156 [main                ] INFO  i.t.b.persistence.impl.DefaultPersistenceTest      - STARTING TESTS OF it.tidalwave.bluemarine2.persistence.impl.DefaultPersistenceTest
06:17:10.361 [main                ] INFO  i.t.bluemarine2.commons.test.SpringTestSupport     - Spring configuration locations: [META-INF/PersistenceTestBeans.xml]
06:17:15.641 [main                ] TRACE it.tidalwave.messagebus.MessageBusHelper           - registerMessageListener(void it.tidalwave.bluemarine2.persistence.impl.DefaultPersistence.onPowerOnNotification(it.tidalwave.bluemarine2.message.PowerOnNotification) throws org.eclipse.rdf4j.repository.RepositoryException,java.io.IOException,org.eclipse.rdf4j.rio.RDFParseException)
06:17:15.679 [main                ] TRACE it.tidalwave.messagebus.MessageBusHelper           - registerMessageListener(void it.tidalwave.bluemarine2.persistence.impl.DefaultPersistence.onPowerOffNotification(it.tidalwave.bluemarine2.message.PowerOffNotification) throws org.eclipse.rdf4j.repository.RepositoryException,java.io.IOException,org.eclipse.rdf4j.rio.RDFParseException)
06:17:15.737 [main                ] INFO  i.t.bluemarine2.commons.test.SpringTestSupport     - >>>> bean names: [org.springframework.context.annotation.internalConfigurationAnnotationProcessor, org.springframework.context.annotation.internalAutowiredAnnotationProcessor, org.springframework.context.annotation.internalCommonAnnotationProcessor, org.springframework.context.event.internalEventListenerProcessor, org.springframework.context.event.internalEventListenerFactory, org.springframework.context.config.internalBeanConfigurerAspect, org.springframework.aop.config.internalAutoProxyCreator, underTest, applicationMessageBus]
06:17:15.767 [main                ] INFO  i.t.b.persistence.impl.DefaultPersistenceTest      - *************************************************
06:17:15.767 [main                ] INFO  i.t.b.persistence.impl.DefaultPersistenceTest      - TEST "must use MemoryStore when no configuration"
06:17:15.769 [main                ] INFO  i.t.b.persistence.impl.DefaultPersistenceTest      - *************************************************
06:17:15.779 [main                ] INFO  i.t.b.persistence.impl.DefaultPersistence          - onPowerOnNotification(PowerOnNotification(properties={}))
06:17:15.786 [main                ] WARN  i.t.b.persistence.impl.DefaultPersistence          - No storage path: working in memory
06:17:15.835 [main                ] DEBUG org.eclipse.rdf4j.sail.memory.MemoryStore          - Initializing MemoryStore...
06:17:15.905 [main                ] DEBUG org.eclipse.rdf4j.sail.memory.MemoryStore          - MemoryStore initialized
06:17:15.920 [main                ] INFO  i.t.b.persistence.impl.DefaultPersistenceTest      - TEST PASSED in 153 msec
06:17:15.921 [main                ] INFO  i.t.b.persistence.impl.DefaultPersistenceTest      - 
06:17:15.947 [nvoker-afterMethod()] INFO  i.t.bluemarine2.commons.test.SpringTestSupport     - Closing Spring context...
06:17:15.953 [main                ] INFO  i.t.bluemarine2.commons.test.SpringTestSupport     - Spring configuration locations: [META-INF/PersistenceTestBeans.xml]
06:17:16.136 [main                ] TRACE it.tidalwave.messagebus.MessageBusHelper           - registerMessageListener(void it.tidalwave.bluemarine2.persistence.impl.DefaultPersistence.onPowerOnNotification(it.tidalwave.bluemarine2.message.PowerOnNotification) throws org.eclipse.rdf4j.repository.RepositoryException,java.io.IOException,org.eclipse.rdf4j.rio.RDFParseException)
06:17:16.174 [main                ] TRACE it.tidalwave.messagebus.MessageBusHelper           - registerMessageListener(void it.tidalwave.bluemarine2.persistence.impl.DefaultPersistence.onPowerOffNotification(it.tidalwave.bluemarine2.message.PowerOffNotification) throws org.eclipse.rdf4j.repository.RepositoryException,java.io.IOException,org.eclipse.rdf4j.rio.RDFParseException)
06:17:16.212 [main                ] INFO  i.t.bluemarine2.commons.test.SpringTestSupport     - >>>> bean names: [org.springframework.context.annotation.internalConfigurationAnnotationProcessor, org.springframework.context.annotation.internalAutowiredAnnotationProcessor, org.springframework.context.annotation.internalCommonAnnotationProcessor, org.springframework.context.event.internalEventListenerProcessor, org.springframework.context.event.internalEventListenerFactory, org.springframework.context.config.internalBeanConfigurerAspect, org.springframework.aop.config.internalAutoProxyCreator, underTest, applicationMessageBus]
06:17:16.249 [main                ] INFO  i.t.b.persistence.impl.DefaultPersistenceTest      - *************************************************************************************
06:17:16.249 [main                ] INFO  i.t.b.persistence.impl.DefaultPersistenceTest      - TEST "must use NativeStore and import when STORAGE FOLDER and IMPORT FILE configured"
06:17:16.250 [main                ] INFO  i.t.b.persistence.impl.DefaultPersistenceTest      - *************************************************************************************
06:17:16.251 [main                ] INFO  i.t.b.persistence.impl.DefaultPersistence          - onPowerOnNotification(PowerOnNotification(properties={Key(name=it.tidalwave.bluemarine2.persistence.storagePath, type=interface java.nio.file.Path)=target/workspace/storageFolder, Key(name=it.tidalwave.bluemarine2.persistence.importFile, type=interface java.nio.file.Path)=target/workspace/triples.n3}))
06:17:16.254 [main                ] INFO  i.t.b.persistence.impl.DefaultPersistence          - Disk storage at Optional[target/workspace/storageFolder]
06:17:16.256 [main                ] WARN  i.t.b.persistence.impl.DefaultPersistence          - Scratching store ...
06:17:16.299 [main                ] DEBUG org.eclipse.rdf4j.sail.nativerdf.NativeStore       - Initializing NativeStore...
06:17:16.409 [main                ] DEBUG org.eclipse.rdf4j.sail.nativerdf.NativeStore       - Data dir is target/workspace/storageFolder
06:17:16.900 [main                ] DEBUG org.eclipse.rdf4j.sail.nativerdf.TripleStore       - No indexes specified, using default indexes: spoc,posc
06:17:16.900 [main                ] TRACE org.eclipse.rdf4j.sail.nativerdf.TripleStore       - Initializing index 'spoc'...
06:17:17.014 [main                ] TRACE org.eclipse.rdf4j.sail.nativerdf.TripleStore       - Initializing index 'posc'...
06:17:17.077 [main                ] DEBUG org.eclipse.rdf4j.sail.nativerdf.ContextStore      - context index has not been created yet: context index file target/workspace/storageFolder/contexts.dat does not exist
06:17:17.079 [main                ] DEBUG org.eclipse.rdf4j.sail.nativerdf.ContextStore      - initializing context cache
06:17:17.091 [main                ] DEBUG org.eclipse.rdf4j.sail.nativerdf.ContextStore      - context index construction complete
06:17:17.151 [main                ] DEBUG org.eclipse.rdf4j.sail.nativerdf.NativeStore       - NativeStore initialized
06:17:17.514 [main                ] INFO  i.t.b.persistence.impl.DefaultPersistence          - Importing repository from target/workspace/triples.n3 ...
06:17:17.602 [main                ] DEBUG org.eclipse.rdf4j.rio.RDFParserRegistry            - Registered service class org.eclipse.rdf4j.rio.ntriples.NTriplesParserFactory
06:17:17.619 [main                ] DEBUG org.eclipse.rdf4j.rio.RDFParserRegistry            - Registered service class org.eclipse.rdf4j.rio.trig.TriGParserFactory
06:17:17.620 [main                ] DEBUG org.eclipse.rdf4j.rio.RDFParserRegistry            - Registered service class org.eclipse.rdf4j.rio.trigstar.TriGStarParserFactory
06:17:17.642 [main                ] DEBUG org.eclipse.rdf4j.rio.RDFParserRegistry            - Registered service class org.eclipse.rdf4j.rio.turtle.TurtleParserFactory
06:17:17.643 [main                ] DEBUG org.eclipse.rdf4j.rio.RDFParserRegistry            - Registered service class org.eclipse.rdf4j.rio.turtlestar.TurtleStarParserFactory
06:17:17.651 [main                ] DEBUG org.eclipse.rdf4j.rio.RDFParserRegistry            - Registered service class org.eclipse.rdf4j.rio.rdfxml.RDFXMLParserFactory
06:17:17.660 [main                ] DEBUG org.eclipse.rdf4j.rio.RDFParserRegistry            - Registered service class org.eclipse.rdf4j.rio.n3.N3ParserFactory
06:17:17.823 [main                ] DEBUG org.eclipse.rdf4j.rio.DatatypeHandlerRegistry      - Registered service class org.eclipse.rdf4j.rio.datatypes.XMLSchemaDatatypeHandler
06:17:17.824 [main                ] DEBUG org.eclipse.rdf4j.rio.DatatypeHandlerRegistry      - Registered service class org.eclipse.rdf4j.rio.datatypes.RDFDatatypeHandler
06:17:17.838 [main                ] DEBUG org.eclipse.rdf4j.rio.DatatypeHandlerRegistry      - Registered service class org.eclipse.rdf4j.rio.datatypes.DBPediaDatatypeHandler
06:17:17.840 [main                ] DEBUG org.eclipse.rdf4j.rio.DatatypeHandlerRegistry      - Registered service class org.eclipse.rdf4j.rio.datatypes.VirtuosoGeometryDatatypeHandler
06:17:17.840 [main                ] DEBUG org.eclipse.rdf4j.rio.DatatypeHandlerRegistry      - Registered service class org.eclipse.rdf4j.rio.datatypes.GeoSPARQLDatatypeHandler
06:17:17.864 [main                ] DEBUG org.eclipse.rdf4j.rio.LanguageHandlerRegistry      - Registered service class org.eclipse.rdf4j.rio.languages.RFC3066LanguageHandler
06:17:17.878 [main                ] DEBUG org.eclipse.rdf4j.rio.LanguageHandlerRegistry      - Registered service class org.eclipse.rdf4j.rio.languages.BCP47LanguageHandler
06:17:20.668 [main                ] INFO  i.t.b.persistence.impl.DefaultPersistence          - exportToFile(target/test-results/export.n3)
06:17:23.711 [main                ] WARN  i.t.u.test.FileComparisonUtilsWithPathNormalizer   - Rewriting target/test-classes/triples.n3 ... (original file is preserved with .orig suffix)
06:17:23.714 [main                ] INFO  it.tidalwave.bluemarine2.util.PathNormalization    - Charset normalizer form: NFC
06:17:25.378 [main                ] WARN  i.t.u.test.FileComparisonUtilsWithPathNormalizer   - Rewriting target/test-results/export.n3 ... (original file is preserved with .orig suffix)
06:17:27.155 [main                ] INFO  it.tidalwave.util.test.FileComparisonUtils         - ******** Comparing files:
06:17:27.156 [main                ] INFO  it.tidalwave.util.test.FileComparisonUtils         - >>>> path is: /var/jenkins_home/jobs/blueMarine2_Metrics_OpenJDK_17/workspace/modules/Persistence/target/
06:17:27.156 [main                ] INFO  it.tidalwave.util.test.FileComparisonUtils         - >>>> exp is:  test-classes/triples.n3
06:17:27.156 [main                ] INFO  it.tidalwave.util.test.FileComparisonUtils         - >>>> act is:  test-results/export.n3
06:17:27.259 [main                ] INFO  i.t.b.persistence.impl.DefaultPersistenceTest      - TEST PASSED in 11010 msec
06:17:27.260 [main                ] INFO  i.t.b.persistence.impl.DefaultPersistenceTest      - 
06:17:27.274 [nvoker-afterMethod()] INFO  i.t.bluemarine2.commons.test.SpringTestSupport     - Closing Spring context...
06:17:27.277 [main                ] INFO  i.t.bluemarine2.commons.test.SpringTestSupport     - Spring configuration locations: [META-INF/PersistenceTestBeans.xml]
06:17:27.388 [main                ] TRACE it.tidalwave.messagebus.MessageBusHelper           - registerMessageListener(void it.tidalwave.bluemarine2.persistence.impl.DefaultPersistence.onPowerOnNotification(it.tidalwave.bluemarine2.message.PowerOnNotification) throws org.eclipse.rdf4j.repository.RepositoryException,java.io.IOException,org.eclipse.rdf4j.rio.RDFParseException)
06:17:27.389 [main                ] TRACE it.tidalwave.messagebus.MessageBusHelper           - registerMessageListener(void it.tidalwave.bluemarine2.persistence.impl.DefaultPersistence.onPowerOffNotification(it.tidalwave.bluemarine2.message.PowerOffNotification) throws org.eclipse.rdf4j.repository.RepositoryException,java.io.IOException,org.eclipse.rdf4j.rio.RDFParseException)
06:17:27.391 [main                ] INFO  i.t.bluemarine2.commons.test.SpringTestSupport     - >>>> bean names: [org.springframework.context.annotation.internalConfigurationAnnotationProcessor, org.springframework.context.annotation.internalAutowiredAnnotationProcessor, org.springframework.context.annotation.internalCommonAnnotationProcessor, org.springframework.context.event.internalEventListenerProcessor, org.springframework.context.event.internalEventListenerFactory, org.springframework.context.config.internalBeanConfigurerAspect, org.springframework.aop.config.internalAutoProxyCreator, underTest, applicationMessageBus]
06:17:27.404 [main                ] INFO  i.t.b.persistence.impl.DefaultPersistenceTest      - ************************************************************************************************************
06:17:27.404 [main                ] INFO  i.t.b.persistence.impl.DefaultPersistenceTest      - TEST "must use NativeStore and import when STORAGE FOLDER and IMPORT FILE configured and rename import file"
06:17:27.404 [main                ] INFO  i.t.b.persistence.impl.DefaultPersistenceTest      - ************************************************************************************************************
06:17:27.405 [main                ] INFO  i.t.b.persistence.impl.DefaultPersistence          - onPowerOnNotification(PowerOnNotification(properties={Key(name=it.tidalwave.bluemarine2.persistence.storagePath, type=interface java.nio.file.Path)=target/workspace/storageFolder, Key(name=it.tidalwave.bluemarine2.persistence.importFile, type=interface java.nio.file.Path)=target/workspace/triples.n3, Key(name=it.tidalwave.bluemarine2.persistence.renameImportFile, type=class java.lang.Boolean)=true}))
06:17:27.406 [main                ] INFO  i.t.b.persistence.impl.DefaultPersistence          - Disk storage at Optional[target/workspace/storageFolder]
06:17:27.406 [main                ] WARN  i.t.b.persistence.impl.DefaultPersistence          - Scratching store ...
06:17:27.406 [main                ] DEBUG org.eclipse.rdf4j.sail.nativerdf.NativeStore       - Initializing NativeStore...
06:17:27.407 [main                ] DEBUG org.eclipse.rdf4j.sail.nativerdf.NativeStore       - Data dir is target/workspace/storageFolder
06:17:27.411 [main                ] DEBUG org.eclipse.rdf4j.sail.nativerdf.TripleStore       - No indexes specified, using default indexes: spoc,posc
06:17:27.411 [main                ] TRACE org.eclipse.rdf4j.sail.nativerdf.TripleStore       - Initializing index 'spoc'...
06:17:27.422 [main                ] TRACE org.eclipse.rdf4j.sail.nativerdf.TripleStore       - Initializing index 'posc'...
06:17:27.423 [main                ] DEBUG org.eclipse.rdf4j.sail.nativerdf.ContextStore      - context index has not been created yet: context index file target/workspace/storageFolder/contexts.dat does not exist
06:17:27.423 [main                ] DEBUG org.eclipse.rdf4j.sail.nativerdf.ContextStore      - initializing context cache
06:17:27.423 [main                ] DEBUG org.eclipse.rdf4j.sail.nativerdf.ContextStore      - context index construction complete
06:17:27.423 [main                ] DEBUG org.eclipse.rdf4j.sail.nativerdf.NativeStore       - NativeStore initialized
06:17:27.423 [main                ] INFO  i.t.b.persistence.impl.DefaultPersistence          - Importing repository from target/workspace/triples.n3 ...
06:17:29.140 [main                ] INFO  i.t.b.persistence.impl.DefaultPersistence          - exportToFile(target/test-results/export.n3)
06:17:30.292 [main                ] WARN  i.t.u.test.FileComparisonUtilsWithPathNormalizer   - Rewriting target/test-classes/triples.n3 ... (original file is preserved with .orig suffix)
06:17:30.741 [main                ] WARN  i.t.u.test.FileComparisonUtilsWithPathNormalizer   - Rewriting target/test-results/export.n3 ... (original file is preserved with .orig suffix)
06:17:31.201 [main                ] INFO  it.tidalwave.util.test.FileComparisonUtils         - ******** Comparing files:
06:17:31.202 [main                ] INFO  it.tidalwave.util.test.FileComparisonUtils         - >>>> path is: /var/jenkins_home/jobs/blueMarine2_Metrics_OpenJDK_17/workspace/modules/Persistence/target/
06:17:31.203 [main                ] INFO  it.tidalwave.util.test.FileComparisonUtils         - >>>> exp is:  test-classes/triples.n3
06:17:31.204 [main                ] INFO  it.tidalwave.util.test.FileComparisonUtils         - >>>> act is:  test-results/export.n3
06:17:31.218 [main                ] INFO  i.t.b.persistence.impl.DefaultPersistenceTest      - TEST PASSED in 3813 msec
06:17:31.218 [main                ] INFO  i.t.b.persistence.impl.DefaultPersistenceTest      - 
06:17:31.219 [nvoker-afterMethod()] INFO  i.t.bluemarine2.commons.test.SpringTestSupport     - Closing Spring context...
06:17:31.222 [main                ] INFO  i.t.bluemarine2.commons.test.SpringTestSupport     - Spring configuration locations: [META-INF/PersistenceTestBeans.xml]
06:17:31.341 [main                ] TRACE it.tidalwave.messagebus.MessageBusHelper           - registerMessageListener(void it.tidalwave.bluemarine2.persistence.impl.DefaultPersistence.onPowerOnNotification(it.tidalwave.bluemarine2.message.PowerOnNotification) throws org.eclipse.rdf4j.repository.RepositoryException,java.io.IOException,org.eclipse.rdf4j.rio.RDFParseException)
06:17:31.359 [main                ] TRACE it.tidalwave.messagebus.MessageBusHelper           - registerMessageListener(void it.tidalwave.bluemarine2.persistence.impl.DefaultPersistence.onPowerOffNotification(it.tidalwave.bluemarine2.message.PowerOffNotification) throws org.eclipse.rdf4j.repository.RepositoryException,java.io.IOException,org.eclipse.rdf4j.rio.RDFParseException)
06:17:31.370 [main                ] INFO  i.t.bluemarine2.commons.test.SpringTestSupport     - >>>> bean names: [org.springframework.context.annotation.internalConfigurationAnnotationProcessor, org.springframework.context.annotation.internalAutowiredAnnotationProcessor, org.springframework.context.annotation.internalCommonAnnotationProcessor, org.springframework.context.event.internalEventListenerProcessor, org.springframework.context.event.internalEventListenerFactory, org.springframework.context.config.internalBeanConfigurerAspect, org.springframework.aop.config.internalAutoProxyCreator, underTest, applicationMessageBus]
06:17:31.394 [main                ] INFO  i.t.b.persistence.impl.DefaultPersistenceTest      - **********************************************************
06:17:31.400 [main                ] INFO  i.t.b.persistence.impl.DefaultPersistenceTest      - TEST "must use NativeStore when STORAGE FOLDER configured"
06:17:31.400 [main                ] INFO  i.t.b.persistence.impl.DefaultPersistenceTest      - **********************************************************
06:17:31.408 [main                ] INFO  i.t.b.persistence.impl.DefaultPersistence          - onPowerOnNotification(PowerOnNotification(properties={Key(name=it.tidalwave.bluemarine2.persistence.storagePath, type=interface java.nio.file.Path)=target/workspace/storageFolder}))
06:17:31.410 [main                ] INFO  i.t.b.persistence.impl.DefaultPersistence          - Disk storage at Optional[target/workspace/storageFolder]
06:17:31.410 [main                ] DEBUG org.eclipse.rdf4j.sail.nativerdf.NativeStore       - Initializing NativeStore...
06:17:31.412 [main                ] DEBUG org.eclipse.rdf4j.sail.nativerdf.NativeStore       - Data dir is target/workspace/storageFolder
06:17:31.431 [main                ] DEBUG org.eclipse.rdf4j.sail.nativerdf.TripleStore       - No indexes specified, using default indexes: spoc,posc
06:17:31.431 [main                ] TRACE org.eclipse.rdf4j.sail.nativerdf.TripleStore       - Initializing index 'spoc'...
06:17:31.431 [main                ] TRACE org.eclipse.rdf4j.sail.nativerdf.TripleStore       - Initializing index 'posc'...
06:17:31.432 [main                ] DEBUG org.eclipse.rdf4j.sail.nativerdf.ContextStore      - context index has not been created yet: context index file target/workspace/storageFolder/contexts.dat does not exist
06:17:31.432 [main                ] DEBUG org.eclipse.rdf4j.sail.nativerdf.ContextStore      - initializing context cache
06:17:31.432 [main                ] DEBUG org.eclipse.rdf4j.sail.nativerdf.ContextStore      - context index construction complete
06:17:31.453 [main                ] DEBUG org.eclipse.rdf4j.sail.nativerdf.NativeStore       - NativeStore initialized
06:17:31.454 [main                ] INFO  i.t.b.persistence.impl.DefaultPersistence          - exportToFile(target/test-results/export.n3)
06:17:31.467 [main                ] INFO  it.tidalwave.util.test.FileComparisonUtils         - ******** Comparing files:
06:17:31.467 [main                ] INFO  it.tidalwave.util.test.FileComparisonUtils         - >>>> path is: /var/jenkins_home/jobs/blueMarine2_Metrics_OpenJDK_17/workspace/modules/Persistence/target/
06:17:31.467 [main                ] INFO  it.tidalwave.util.test.FileComparisonUtils         - >>>> exp is:  test-classes/empty.n3
06:17:31.467 [main                ] INFO  it.tidalwave.util.test.FileComparisonUtils         - >>>> act is:  test-results/export.n3
06:17:31.468 [main                ] INFO  i.t.b.persistence.impl.DefaultPersistenceTest      - TEST PASSED in 73 msec
06:17:31.468 [main                ] INFO  i.t.b.persistence.impl.DefaultPersistenceTest      - 
06:17:31.477 [nvoker-afterMethod()] INFO  i.t.bluemarine2.commons.test.SpringTestSupport     - Closing Spring context...
06:17:31.481 [main                ] INFO  i.t.bluemarine2.commons.test.SpringTestSupport     - Spring configuration locations: [META-INF/PersistenceTestBeans.xml]
06:17:31.632 [main                ] TRACE it.tidalwave.messagebus.MessageBusHelper           - registerMessageListener(void it.tidalwave.bluemarine2.persistence.impl.DefaultPersistence.onPowerOnNotification(it.tidalwave.bluemarine2.message.PowerOnNotification) throws org.eclipse.rdf4j.repository.RepositoryException,java.io.IOException,org.eclipse.rdf4j.rio.RDFParseException)
06:17:31.633 [main                ] TRACE it.tidalwave.messagebus.MessageBusHelper           - registerMessageListener(void it.tidalwave.bluemarine2.persistence.impl.DefaultPersistence.onPowerOffNotification(it.tidalwave.bluemarine2.message.PowerOffNotification) throws org.eclipse.rdf4j.repository.RepositoryException,java.io.IOException,org.eclipse.rdf4j.rio.RDFParseException)
06:17:31.653 [main                ] INFO  i.t.bluemarine2.commons.test.SpringTestSupport     - >>>> bean names: [org.springframework.context.annotation.internalConfigurationAnnotationProcessor, org.springframework.context.annotation.internalAutowiredAnnotationProcessor, org.springframework.context.annotation.internalCommonAnnotationProcessor, org.springframework.context.event.internalEventListenerProcessor, org.springframework.context.event.internalEventListenerFactory, org.springframework.context.config.internalBeanConfigurerAspect, org.springframework.aop.config.internalAutoProxyCreator, underTest, applicationMessageBus]
06:17:31.657 [main                ] INFO  i.t.b.persistence.impl.DefaultPersistenceTest      - **************************************************************************
06:17:31.657 [main                ] INFO  i.t.b.persistence.impl.DefaultPersistenceTest      - TEST "must use NativeStore when STORAGE FOLDER configured and not scratch"
06:17:31.657 [main                ] INFO  i.t.b.persistence.impl.DefaultPersistenceTest      - **************************************************************************
06:17:31.668 [main                ] DEBUG org.eclipse.rdf4j.sail.nativerdf.NativeStore       - Initializing NativeStore...
06:17:31.669 [main                ] DEBUG org.eclipse.rdf4j.sail.nativerdf.NativeStore       - Data dir is target/workspace/storageFolder
06:17:31.673 [main                ] DEBUG org.eclipse.rdf4j.sail.nativerdf.TripleStore       - No indexes specified, using default indexes: spoc,posc
06:17:31.690 [main                ] TRACE org.eclipse.rdf4j.sail.nativerdf.TripleStore       - Initializing index 'spoc'...
06:17:31.697 [main                ] TRACE org.eclipse.rdf4j.sail.nativerdf.TripleStore       - Initializing index 'posc'...
06:17:31.699 [main                ] DEBUG org.eclipse.rdf4j.sail.nativerdf.ContextStore      - context index has not been created yet: context index file target/workspace/storageFolder/contexts.dat does not exist
06:17:31.703 [main                ] DEBUG org.eclipse.rdf4j.sail.nativerdf.ContextStore      - initializing context cache
06:17:31.705 [main                ] DEBUG org.eclipse.rdf4j.sail.nativerdf.ContextStore      - context index construction complete
06:17:31.706 [main                ] DEBUG org.eclipse.rdf4j.sail.nativerdf.NativeStore       - NativeStore initialized
06:17:33.618 [main                ] DEBUG org.eclipse.rdf4j.sail.nativerdf.NativeStore       - Shutting down NativeStore...
06:17:33.619 [main                ] DEBUG org.eclipse.rdf4j.sail.nativerdf.NativeStore       - NativeStore shut down
06:17:33.620 [main                ] DEBUG org.eclipse.rdf4j.sail.nativerdf.NativeStore       - NativeStore shut down
06:17:33.620 [main                ] INFO  i.t.b.persistence.impl.DefaultPersistence          - onPowerOnNotification(PowerOnNotification(properties={Key(name=it.tidalwave.bluemarine2.persistence.storagePath, type=interface java.nio.file.Path)=target/workspace/storageFolder}))
06:17:33.620 [main                ] INFO  i.t.b.persistence.impl.DefaultPersistence          - Disk storage at Optional[target/workspace/storageFolder]
06:17:33.620 [main                ] DEBUG org.eclipse.rdf4j.sail.nativerdf.NativeStore       - Initializing NativeStore...
06:17:33.621 [main                ] DEBUG org.eclipse.rdf4j.sail.nativerdf.NativeStore       - Data dir is target/workspace/storageFolder
06:17:33.640 [main                ] TRACE org.eclipse.rdf4j.sail.nativerdf.TripleStore       - Initializing index 'spoc'...
06:17:33.641 [main                ] TRACE org.eclipse.rdf4j.sail.nativerdf.TripleStore       - Initializing index 'posc'...
06:17:33.649 [main                ] TRACE org.eclipse.rdf4j.sail.nativerdf.TripleStore       - No uncompleted transactions found
06:17:33.650 [main                ] DEBUG org.eclipse.rdf4j.sail.nativerdf.NativeStore       - NativeStore initialized
06:17:33.650 [main                ] INFO  i.t.b.persistence.impl.DefaultPersistence          - exportToFile(target/test-results/export.n3)
06:17:34.865 [main                ] WARN  i.t.u.test.FileComparisonUtilsWithPathNormalizer   - Rewriting target/test-classes/triples.n3 ... (original file is preserved with .orig suffix)
06:17:36.164 [main                ] WARN  i.t.u.test.FileComparisonUtilsWithPathNormalizer   - Rewriting target/test-results/export.n3 ... (original file is preserved with .orig suffix)
06:17:37.888 [main                ] INFO  it.tidalwave.util.test.FileComparisonUtils         - ******** Comparing files:
06:17:37.889 [main                ] INFO  it.tidalwave.util.test.FileComparisonUtils         - >>>> path is: /var/jenkins_home/jobs/blueMarine2_Metrics_OpenJDK_17/workspace/modules/Persistence/target/
06:17:37.889 [main                ] INFO  it.tidalwave.util.test.FileComparisonUtils         - >>>> exp is:  test-classes/triples.n3
06:17:37.889 [main                ] INFO  it.tidalwave.util.test.FileComparisonUtils         - >>>> act is:  test-results/export.n3
06:17:37.944 [main                ] INFO  i.t.b.persistence.impl.DefaultPersistenceTest      - TEST PASSED in 6288 msec
06:17:37.945 [main                ] INFO  i.t.b.persistence.impl.DefaultPersistenceTest      - 
06:17:37.971 [nvoker-afterMethod()] INFO  i.t.bluemarine2.commons.test.SpringTestSupport     - Closing Spring context...
06:17:38.068 [main                ] INFO  i.t.b.persistence.impl.DefaultPersistenceTest      - FINISHED TESTS OF it.tidalwave.bluemarine2.persistence.impl.DefaultPersistenceTest
[INFO] Tests run: 5, Failures: 0, Errors: 0, Skipped: 0, Time elapsed: 31.188 s - in it.tidalwave.bluemarine2.persistence.impl.DefaultPersistenceTest
[INFO] 
[INFO] Results:
[INFO] 
[INFO] Tests run: 5, Failures: 0, Errors: 0, Skipped: 0
[INFO] 
[JENKINS] Recording test results
[INFO] 
[INFO] --- jacoco-maven-plugin:0.8.7:report (report) @ it-tidalwave-bluemarine2-persistence ---
[INFO] Loading execution data file /var/jenkins_home/jobs/blueMarine2_Metrics_OpenJDK_17/workspace/modules/Persistence/target/jacoco.exec
[INFO] Analyzed bundle 'blueMarine II :: Persistence' with 4 classes
[INFO] 
[INFO] --- maven-jar-plugin:3.2.0:jar (default-jar) @ it-tidalwave-bluemarine2-persistence ---
[INFO] Building jar: /var/jenkins_home/jobs/blueMarine2_Metrics_OpenJDK_17/workspace/modules/Persistence/target/it-tidalwave-bluemarine2-persistence-1.1-ALPHA-2-SNAPSHOT.5bd725d04573.jar
[INFO] 
[INFO] --- maven-jar-plugin:3.2.0:test-jar (default-test-jar) @ it-tidalwave-bluemarine2-persistence ---
[INFO] Building jar: /var/jenkins_home/jobs/blueMarine2_Metrics_OpenJDK_17/workspace/modules/Persistence/target/it-tidalwave-bluemarine2-persistence-1.1-ALPHA-2-SNAPSHOT.5bd725d04573-tests.jar
[INFO] 
[INFO] --- maven-install-plugin:3.0.0-M1:install (default-install) @ it-tidalwave-bluemarine2-persistence ---
[INFO] Installing /var/jenkins_home/jobs/blueMarine2_Metrics_OpenJDK_17/workspace/modules/Persistence/target/it-tidalwave-bluemarine2-persistence-1.1-ALPHA-2-SNAPSHOT.5bd725d04573.jar to /var/jenkins_home/jobs/blueMarine2_Metrics_OpenJDK_17/workspace@tmp/repository/it/tidalwave/bluemarine2/it-tidalwave-bluemarine2-persistence/1.1-ALPHA-2-SNAPSHOT/it-tidalwave-bluemarine2-persistence-1.1-ALPHA-2-SNAPSHOT.jar
[INFO] Installing /var/jenkins_home/jobs/blueMarine2_Metrics_OpenJDK_17/workspace/modules/Persistence/pom.xml to /var/jenkins_home/jobs/blueMarine2_Metrics_OpenJDK_17/workspace@tmp/repository/it/tidalwave/bluemarine2/it-tidalwave-bluemarine2-persistence/1.1-ALPHA-2-SNAPSHOT/it-tidalwave-bluemarine2-persistence-1.1-ALPHA-2-SNAPSHOT.pom
[INFO] Installing /var/jenkins_home/jobs/blueMarine2_Metrics_OpenJDK_17/workspace/modules/Persistence/target/it-tidalwave-bluemarine2-persistence-1.1-ALPHA-2-SNAPSHOT.5bd725d04573-tests.jar to /var/jenkins_home/jobs/blueMarine2_Metrics_OpenJDK_17/workspace@tmp/repository/it/tidalwave/bluemarine2/it-tidalwave-bluemarine2-persistence/1.1-ALPHA-2-SNAPSHOT/it-tidalwave-bluemarine2-persistence-1.1-ALPHA-2-SNAPSHOT-tests.jar
[INFO] 
[INFO] >>> maven-dependency-plugin:3.1.2:analyze (default-cli) > test-compile @ it-tidalwave-bluemarine2-persistence >>>
[INFO] 
[INFO] --- buildnumber-maven-plugin:1.4:create (default) @ it-tidalwave-bluemarine2-persistence ---
[INFO] ShortRevision tag detected. The value is '12'.
[INFO] Executing: /bin/sh -c cd '/var/jenkins_home/jobs/blueMarine2_Metrics_OpenJDK_17/workspace/modules/Persistence' && 'git' 'rev-parse' '--verify' '--short=12' 'HEAD'
[INFO] Working directory: /var/jenkins_home/jobs/blueMarine2_Metrics_OpenJDK_17/workspace/modules/Persistence
[INFO] Storing buildNumber: 5bd725d04573 at timestamp: 1659932260002
[WARNING] Cannot get the branch information from the git repository: 
Detecting the current branch failed: fatal: ref HEAD is not a symbolic ref

[INFO] ShortRevision tag detected. The value is '12'.
[INFO] Executing: /bin/sh -c cd '/var/jenkins_home/jobs/blueMarine2_Metrics_OpenJDK_17/workspace/modules/Persistence' && 'git' 'rev-parse' '--verify' '--short=12' 'HEAD'
[INFO] Working directory: /var/jenkins_home/jobs/blueMarine2_Metrics_OpenJDK_17/workspace/modules/Persistence
[INFO] Storing buildScmBranch: UNKNOWN
[INFO] 
[INFO] --- maven-enforcer-plugin:3.0.0-M3:enforce (enforce-maven) @ it-tidalwave-bluemarine2-persistence ---
[INFO] 
[INFO] --- maven-enforcer-plugin:3.0.0-M3:enforce (enforce-banned-dependencies) @ it-tidalwave-bluemarine2-persistence ---
[INFO] 
[INFO] --- maven-antrun-plugin:3.0.0:run (generate-and-print-build-description) @ it-tidalwave-bluemarine2-persistence ---
[INFO] Executing tasks
[INFO]      [echo] DESCRIPTION: origin/master 1.1-ALPHA-2-SNAPSHOT 5bd725d04573
[INFO]      [echo] Java Version: 17.0.1 -source 11 -target 11 -release 11
[INFO] Executed tasks
[INFO] 
[INFO] --- jacoco-maven-plugin:0.8.7:prepare-agent (prepare-agent) @ it-tidalwave-bluemarine2-persistence ---
[INFO] tft.test.jacoco.argLine set to -javaagent:/var/jenkins_home/jobs/blueMarine2_Metrics_OpenJDK_17/workspace@tmp/repository/org/jacoco/org.jacoco.agent/0.8.7/org.jacoco.agent-0.8.7-runtime.jar=destfile=/var/jenkins_home/jobs/blueMarine2_Metrics_OpenJDK_17/workspace/modules/Persistence/target/jacoco.exec
[INFO] 
[INFO] --- maven-antrun-plugin:3.0.0:run (create-unwoven-classes-dirs) @ it-tidalwave-bluemarine2-persistence ---
[INFO] Executing tasks
[INFO] Executed tasks
[INFO] 
[INFO] --- maven-resources-plugin:3.2.0:resources (default-resources) @ it-tidalwave-bluemarine2-persistence ---
[INFO] Using 'UTF-8' encoding to copy filtered resources.
[INFO] Using 'UTF-8' encoding to copy filtered properties files.
[INFO] Copying 1 resource
[INFO] 
[INFO] --- maven-compiler-plugin:3.8.1:compile (default-compile) @ it-tidalwave-bluemarine2-persistence ---
[INFO] Changes detected - recompiling the module!
[INFO] Compiling 4 source files to /var/jenkins_home/jobs/blueMarine2_Metrics_OpenJDK_17/workspace/modules/Persistence/target/unwoven-classes
[WARNING] No processor claimed any of these annotations: /javax.annotation.Nonnull,/it.tidalwave.util.annotation.VisibleForTesting,/it.tidalwave.messagebus.annotation.ListensTo,/it.tidalwave.messagebus.annotation.SimpleMessageSubscriber,/javax.inject.Inject
[WARNING] /var/jenkins_home/jobs/blueMarine2_Metrics_OpenJDK_17/workspace/modules/Persistence/src/main/java/it/tidalwave/bluemarine2/persistence/impl/RepositoryDelegate.java:[60,16] [deprecation] initialize() in Repository has been deprecated
[WARNING] /var/jenkins_home/jobs/blueMarine2_Metrics_OpenJDK_17/workspace/modules/Persistence/src/main/java/it/tidalwave/bluemarine2/persistence/impl/DefaultPersistence.java:[128,18] [deprecation] initialize() in Repository has been deprecated
[INFO] 
[INFO] --- aspectj-maven-plugin:1.11:compile (weave-classes) @ it-tidalwave-bluemarine2-persistence ---
[INFO] Showing AJC message detail for messages of types: [error, warning, fail]
[INFO] 
[INFO] --- maven-resources-plugin:3.2.0:testResources (default-testResources) @ it-tidalwave-bluemarine2-persistence ---
[INFO] Using 'UTF-8' encoding to copy filtered resources.
[INFO] Using 'UTF-8' encoding to copy filtered properties files.
[INFO] Copying 3 resources
[INFO] 
[INFO] --- maven-compiler-plugin:3.8.1:testCompile (default-testCompile) @ it-tidalwave-bluemarine2-persistence ---
[INFO] Changes detected - recompiling the module!
[INFO] Compiling 1 source file to /var/jenkins_home/jobs/blueMarine2_Metrics_OpenJDK_17/workspace/modules/Persistence/target/unwoven-test-classes
[WARNING] No processor claimed any of these annotations: /org.testng.annotations.Test,/javax.annotation.Nonnull,/org.testng.annotations.BeforeMethod
[WARNING] /var/jenkins_home/jobs/blueMarine2_Metrics_OpenJDK_17/workspace/modules/Persistence/src/test/java/it/tidalwave/bluemarine2/persistence/impl/DefaultPersistenceTest.java:[232,18] [deprecation] initialize() in Repository has been deprecated
[WARNING] Failed to getClass for org.apache.maven.plugins.dependency.analyze.AnalyzeMojo
[INFO] 
[INFO] <<< maven-dependency-plugin:3.1.2:analyze (default-cli) < test-compile @ it-tidalwave-bluemarine2-persistence <<<
[INFO] 
[INFO] 
[INFO] --- maven-dependency-plugin:3.1.2:analyze (default-cli) @ it-tidalwave-bluemarine2-persistence ---
[WARNING] Used undeclared dependencies found:
[WARNING]    com.google.code.findbugs:jsr305:jar:3.0.2:compile
[WARNING]    org.eclipse.rdf4j:rdf4j-rio-api:jar:3.6.2:compile
[WARNING]    com.github.spotbugs:spotbugs-annotations:jar:3.1.9:compile
[WARNING]    org.hamcrest:hamcrest-core:jar:1.3:test
[WARNING]    org.eclipse.rdf4j:rdf4j-model-api:jar:3.6.2:compile
[WARNING]    org.eclipse.rdf4j:rdf4j-repository-api:jar:3.6.2:compile
[WARNING]    org.eclipse.rdf4j:rdf4j-sail-api:jar:3.6.2:compile
[WARNING]    it.tidalwave.thesefoolishthings:it-tidalwave-util:jar:3.2-ALPHA-11:compile
[WARNING]    commons-io:commons-io:jar:2.7:compile
[WARNING] Unused declared dependencies found:
[WARNING]    it.tidalwave.bluemarine2:it-tidalwave-bluemarine2-model:jar:1.1-ALPHA-2-SNAPSHOT:compile
[WARNING]    it.tidalwave.thesefoolishthings:it-tidalwave-role-spring:jar:3.2-ALPHA-11:compile
[WARNING]    org.eclipse.rdf4j:rdf4j-rio-rdfxml:jar:3.6.2:compile
[WARNING]    org.springframework:spring-aspects:jar:5.3.1:compile
[WARNING]    org.projectlombok:lombok:jar:1.18.22:provided
[WARNING]    org.slf4j:jcl-over-slf4j:jar:1.7.30:runtime
[WARNING]    org.slf4j:jul-to-slf4j:jar:1.7.30:runtime
[WARNING]    ch.qos.logback:logback-classic:jar:1.2.3:runtime
[WARNING]    it.tidalwave.thesefoolishthings:it-tidalwave-util-test:jar:3.2-ALPHA-11:test
[WARNING]    org.hamcrest:hamcrest-all:jar:1.3:test
[WARNING]    org.mockito:mockito-core:jar:3.8.0:test
[WARNING]    org.aspectj:aspectjrt:jar:1.9.6:compile
[JENKINS] Archiving disabled
Started calculate disk usage of build
Finished Calculation of disk usage of build in 0 seconds
Started calculate disk usage of workspace
Finished Calculation of disk usage of workspace in 0 seconds
[INFO] 
[INFO] ----< it.tidalwave.bluemarine2:it-tidalwave-bluemarine2-vocabulary >----
[INFO] Building blueMarine II :: Vocabulary 1.1-ALPHA-2-SNAPSHOT         [8/26]
[INFO] --------------------------------[ jar ]---------------------------------
[INFO] 
[INFO] --- maven-clean-plugin:3.1.0:clean (default-clean) @ it-tidalwave-bluemarine2-vocabulary ---
[INFO] 
[INFO] --- buildnumber-maven-plugin:1.4:create (default) @ it-tidalwave-bluemarine2-vocabulary ---
[INFO] ShortRevision tag detected. The value is '12'.
[INFO] Executing: /bin/sh -c cd '/var/jenkins_home/jobs/blueMarine2_Metrics_OpenJDK_17/workspace/modules/Vocabulary' && 'git' 'rev-parse' '--verify' '--short=12' 'HEAD'
[INFO] Working directory: /var/jenkins_home/jobs/blueMarine2_Metrics_OpenJDK_17/workspace/modules/Vocabulary
[INFO] Storing buildNumber: 5bd725d04573 at timestamp: 1659932273380
[WARNING] Cannot get the branch information from the git repository: 
Detecting the current branch failed: fatal: ref HEAD is not a symbolic ref

[INFO] ShortRevision tag detected. The value is '12'.
[INFO] Executing: /bin/sh -c cd '/var/jenkins_home/jobs/blueMarine2_Metrics_OpenJDK_17/workspace/modules/Vocabulary' && 'git' 'rev-parse' '--verify' '--short=12' 'HEAD'
[INFO] Working directory: /var/jenkins_home/jobs/blueMarine2_Metrics_OpenJDK_17/workspace/modules/Vocabulary
[INFO] Storing buildScmBranch: UNKNOWN
[INFO] 
[INFO] --- maven-enforcer-plugin:3.0.0-M3:enforce (enforce-maven) @ it-tidalwave-bluemarine2-vocabulary ---
[INFO] 
[INFO] --- maven-enforcer-plugin:3.0.0-M3:enforce (enforce-banned-dependencies) @ it-tidalwave-bluemarine2-vocabulary ---
[INFO] 
[INFO] --- maven-antrun-plugin:3.0.0:run (generate-and-print-build-description) @ it-tidalwave-bluemarine2-vocabulary ---
[INFO] Executing tasks
[INFO]      [echo] DESCRIPTION: origin/master 1.1-ALPHA-2-SNAPSHOT 5bd725d04573
[INFO]      [echo] Java Version: 17.0.1 -source 11 -target 11 -release 11
[INFO] Executed tasks
[INFO] 
[INFO] --- jacoco-maven-plugin:0.8.7:prepare-agent (prepare-agent) @ it-tidalwave-bluemarine2-vocabulary ---
[INFO] tft.test.jacoco.argLine set to -javaagent:/var/jenkins_home/jobs/blueMarine2_Metrics_OpenJDK_17/workspace@tmp/repository/org/jacoco/org.jacoco.agent/0.8.7/org.jacoco.agent-0.8.7-runtime.jar=destfile=/var/jenkins_home/jobs/blueMarine2_Metrics_OpenJDK_17/workspace/modules/Vocabulary/target/jacoco.exec
[INFO] 
[INFO] --- maven-resources-plugin:3.2.0:resources (default-resources) @ it-tidalwave-bluemarine2-vocabulary ---
[INFO] Using 'UTF-8' encoding to copy filtered resources.
[INFO] Using 'UTF-8' encoding to copy filtered properties files.
[INFO] skip non existing resourceDirectory /var/jenkins_home/jobs/blueMarine2_Metrics_OpenJDK_17/workspace/modules/Vocabulary/src/main/resources
[INFO] 
[INFO] --- maven-compiler-plugin:3.8.1:compile (default-compile) @ it-tidalwave-bluemarine2-vocabulary ---
[INFO] Changes detected - recompiling the module!
[INFO] Compiling 4 source files to /var/jenkins_home/jobs/blueMarine2_Metrics_OpenJDK_17/workspace/modules/Vocabulary/target/classes
[WARNING] No processor claimed any of these annotations: /javax.annotation.Nonnull
[INFO] 
[INFO] --- maven-resources-plugin:3.2.0:testResources (default-testResources) @ it-tidalwave-bluemarine2-vocabulary ---
[INFO] Using 'UTF-8' encoding to copy filtered resources.
[INFO] Using 'UTF-8' encoding to copy filtered properties files.
[INFO] skip non existing resourceDirectory /var/jenkins_home/jobs/blueMarine2_Metrics_OpenJDK_17/workspace/modules/Vocabulary/src/test/resources
[INFO] 
[INFO] --- maven-compiler-plugin:3.8.1:testCompile (default-testCompile) @ it-tidalwave-bluemarine2-vocabulary ---
[INFO] No sources to compile
[INFO] 
[INFO] --- maven-surefire-plugin:3.0.0-M5:test (default-test) @ it-tidalwave-bluemarine2-vocabulary ---
[INFO] No tests to run.
[JENKINS] Recording test results
[INFO] 
[INFO] --- jacoco-maven-plugin:0.8.7:report (report) @ it-tidalwave-bluemarine2-vocabulary ---
[INFO] Skipping JaCoCo execution due to missing execution data file.
[INFO] 
[INFO] --- maven-jar-plugin:3.2.0:jar (default-jar) @ it-tidalwave-bluemarine2-vocabulary ---
[INFO] Building jar: /var/jenkins_home/jobs/blueMarine2_Metrics_OpenJDK_17/workspace/modules/Vocabulary/target/it-tidalwave-bluemarine2-vocabulary-1.1-ALPHA-2-SNAPSHOT.5bd725d04573.jar
[INFO] 
[INFO] --- maven-jar-plugin:3.2.0:test-jar (default-test-jar) @ it-tidalwave-bluemarine2-vocabulary ---
[INFO] Skipping packaging of the test-jar
[INFO] 
[INFO] --- maven-install-plugin:3.0.0-M1:install (default-install) @ it-tidalwave-bluemarine2-vocabulary ---
[INFO] Installing /var/jenkins_home/jobs/blueMarine2_Metrics_OpenJDK_17/workspace/modules/Vocabulary/target/it-tidalwave-bluemarine2-vocabulary-1.1-ALPHA-2-SNAPSHOT.5bd725d04573.jar to /var/jenkins_home/jobs/blueMarine2_Metrics_OpenJDK_17/workspace@tmp/repository/it/tidalwave/bluemarine2/it-tidalwave-bluemarine2-vocabulary/1.1-ALPHA-2-SNAPSHOT/it-tidalwave-bluemarine2-vocabulary-1.1-ALPHA-2-SNAPSHOT.jar
[INFO] Installing /var/jenkins_home/jobs/blueMarine2_Metrics_OpenJDK_17/workspace/modules/Vocabulary/pom.xml to /var/jenkins_home/jobs/blueMarine2_Metrics_OpenJDK_17/workspace@tmp/repository/it/tidalwave/bluemarine2/it-tidalwave-bluemarine2-vocabulary/1.1-ALPHA-2-SNAPSHOT/it-tidalwave-bluemarine2-vocabulary-1.1-ALPHA-2-SNAPSHOT.pom
[INFO] 
[INFO] >>> maven-dependency-plugin:3.1.2:analyze (default-cli) > test-compile @ it-tidalwave-bluemarine2-vocabulary >>>
[INFO] 
[INFO] --- buildnumber-maven-plugin:1.4:create (default) @ it-tidalwave-bluemarine2-vocabulary ---
[INFO] ShortRevision tag detected. The value is '12'.
[INFO] Executing: /bin/sh -c cd '/var/jenkins_home/jobs/blueMarine2_Metrics_OpenJDK_17/workspace/modules/Vocabulary' && 'git' 'rev-parse' '--verify' '--short=12' 'HEAD'
[INFO] Working directory: /var/jenkins_home/jobs/blueMarine2_Metrics_OpenJDK_17/workspace/modules/Vocabulary
[INFO] Storing buildNumber: 5bd725d04573 at timestamp: 1659932281744
[WARNING] Cannot get the branch information from the git repository: 
Detecting the current branch failed: fatal: ref HEAD is not a symbolic ref

[INFO] ShortRevision tag detected. The value is '12'.
[INFO] Executing: /bin/sh -c cd '/var/jenkins_home/jobs/blueMarine2_Metrics_OpenJDK_17/workspace/modules/Vocabulary' && 'git' 'rev-parse' '--verify' '--short=12' 'HEAD'
[INFO] Working directory: /var/jenkins_home/jobs/blueMarine2_Metrics_OpenJDK_17/workspace/modules/Vocabulary
[INFO] Storing buildScmBranch: UNKNOWN
[INFO] 
[INFO] --- maven-enforcer-plugin:3.0.0-M3:enforce (enforce-maven) @ it-tidalwave-bluemarine2-vocabulary ---
[INFO] 
[INFO] --- maven-enforcer-plugin:3.0.0-M3:enforce (enforce-banned-dependencies) @ it-tidalwave-bluemarine2-vocabulary ---
[INFO] 
[INFO] --- maven-antrun-plugin:3.0.0:run (generate-and-print-build-description) @ it-tidalwave-bluemarine2-vocabulary ---
[INFO] Executing tasks
[INFO]      [echo] DESCRIPTION: origin/master 1.1-ALPHA-2-SNAPSHOT 5bd725d04573
[INFO]      [echo] Java Version: 17.0.1 -source 11 -target 11 -release 11
[INFO] Executed tasks
[INFO] 
[INFO] --- jacoco-maven-plugin:0.8.7:prepare-agent (prepare-agent) @ it-tidalwave-bluemarine2-vocabulary ---
[INFO] tft.test.jacoco.argLine set to -javaagent:/var/jenkins_home/jobs/blueMarine2_Metrics_OpenJDK_17/workspace@tmp/repository/org/jacoco/org.jacoco.agent/0.8.7/org.jacoco.agent-0.8.7-runtime.jar=destfile=/var/jenkins_home/jobs/blueMarine2_Metrics_OpenJDK_17/workspace/modules/Vocabulary/target/jacoco.exec
[INFO] 
[INFO] --- maven-resources-plugin:3.2.0:resources (default-resources) @ it-tidalwave-bluemarine2-vocabulary ---
[INFO] Using 'UTF-8' encoding to copy filtered resources.
[INFO] Using 'UTF-8' encoding to copy filtered properties files.
[INFO] skip non existing resourceDirectory /var/jenkins_home/jobs/blueMarine2_Metrics_OpenJDK_17/workspace/modules/Vocabulary/src/main/resources
[INFO] 
[INFO] --- maven-compiler-plugin:3.8.1:compile (default-compile) @ it-tidalwave-bluemarine2-vocabulary ---
[INFO] Changes detected - recompiling the module!
[INFO] Compiling 4 source files to /var/jenkins_home/jobs/blueMarine2_Metrics_OpenJDK_17/workspace/modules/Vocabulary/target/classes
[WARNING] No processor claimed any of these annotations: /javax.annotation.Nonnull
[INFO] 
[INFO] --- maven-resources-plugin:3.2.0:testResources (default-testResources) @ it-tidalwave-bluemarine2-vocabulary ---
[INFO] Using 'UTF-8' encoding to copy filtered resources.
[INFO] Using 'UTF-8' encoding to copy filtered properties files.
[INFO] skip non existing resourceDirectory /var/jenkins_home/jobs/blueMarine2_Metrics_OpenJDK_17/workspace/modules/Vocabulary/src/test/resources
[INFO] 
[INFO] --- maven-compiler-plugin:3.8.1:testCompile (default-testCompile) @ it-tidalwave-bluemarine2-vocabulary ---
[INFO] No sources to compile
[WARNING] Failed to getClass for org.apache.maven.plugins.dependency.analyze.AnalyzeMojo
[INFO] 
[INFO] <<< maven-dependency-plugin:3.1.2:analyze (default-cli) < test-compile @ it-tidalwave-bluemarine2-vocabulary <<<
[INFO] 
[INFO] 
[INFO] --- maven-dependency-plugin:3.1.2:analyze (default-cli) @ it-tidalwave-bluemarine2-vocabulary ---
[WARNING] Used undeclared dependencies found:
[WARNING]    com.google.code.findbugs:jsr305:jar:3.0.2:compile
[WARNING]    com.github.spotbugs:spotbugs-annotations:jar:3.1.9:compile
[WARNING]    org.eclipse.rdf4j:rdf4j-model:jar:3.6.2:compile
[WARNING]    org.eclipse.rdf4j:rdf4j-model-api:jar:3.6.2:compile
[WARNING] Unused declared dependencies found:
[WARNING]    org.eclipse.rdf4j:rdf4j-repository-api:jar:3.6.2:compile
[WARNING]    javax.inject:javax.inject:jar:1:compile
[WARNING]    org.slf4j:slf4j-api:jar:1.7.30:compile
[WARNING]    org.projectlombok:lombok:jar:1.18.22:provided
[WARNING]    org.slf4j:jcl-over-slf4j:jar:1.7.30:runtime
[WARNING]    org.slf4j:jul-to-slf4j:jar:1.7.30:runtime
[WARNING]    ch.qos.logback:logback-classic:jar:1.2.3:runtime
[WARNING]    it.tidalwave.thesefoolishthings:it-tidalwave-util-test:jar:3.2-ALPHA-11:test
[WARNING]    org.testng:testng:jar:6.9.10:test
[WARNING]    org.hamcrest:hamcrest-all:jar:1.3:test
[WARNING]    org.mockito:mockito-core:jar:3.8.0:test
[JENKINS] Archiving disabled
Started calculate disk usage of build
Finished Calculation of disk usage of build in 0 seconds
Started calculate disk usage of workspace
Finished Calculation of disk usage of workspace in 0 seconds
[INFO] 
[INFO] --< it.tidalwave.bluemarine2:it-tidalwave-bluemarine2-musicbrainz-datamodel >--
[INFO] Building blueMarine II :: MusicBrainz :: Data Model 1.1-ALPHA-2-SNAPSHOT [9/26]
[INFO] --------------------------------[ jar ]---------------------------------
[INFO] 
[INFO] --- maven-clean-plugin:3.1.0:clean (default-clean) @ it-tidalwave-bluemarine2-musicbrainz-datamodel ---
[INFO] 
[INFO] --- buildnumber-maven-plugin:1.4:create (default) @ it-tidalwave-bluemarine2-musicbrainz-datamodel ---
[INFO] ShortRevision tag detected. The value is '12'.
[INFO] Executing: /bin/sh -c cd '/var/jenkins_home/jobs/blueMarine2_Metrics_OpenJDK_17/workspace/modules/MusicBrainzDataModel' && 'git' 'rev-parse' '--verify' '--short=12' 'HEAD'
[INFO] Working directory: /var/jenkins_home/jobs/blueMarine2_Metrics_OpenJDK_17/workspace/modules/MusicBrainzDataModel
[INFO] Storing buildNumber: 5bd725d04573 at timestamp: 1659932290254
[WARNING] Cannot get the branch information from the git repository: 
Detecting the current branch failed: fatal: ref HEAD is not a symbolic ref

[INFO] ShortRevision tag detected. The value is '12'.
[INFO] Executing: /bin/sh -c cd '/var/jenkins_home/jobs/blueMarine2_Metrics_OpenJDK_17/workspace/modules/MusicBrainzDataModel' && 'git' 'rev-parse' '--verify' '--short=12' 'HEAD'
[INFO] Working directory: /var/jenkins_home/jobs/blueMarine2_Metrics_OpenJDK_17/workspace/modules/MusicBrainzDataModel
[INFO] Storing buildScmBranch: UNKNOWN
[INFO] 
[INFO] --- maven-enforcer-plugin:3.0.0-M3:enforce (enforce-maven) @ it-tidalwave-bluemarine2-musicbrainz-datamodel ---
[INFO] 
[INFO] --- maven-enforcer-plugin:3.0.0-M3:enforce (enforce-banned-dependencies) @ it-tidalwave-bluemarine2-musicbrainz-datamodel ---
[INFO] 
[INFO] --- maven-antrun-plugin:3.0.0:run (generate-and-print-build-description) @ it-tidalwave-bluemarine2-musicbrainz-datamodel ---
[INFO] Executing tasks
[INFO]      [echo] DESCRIPTION: origin/master 1.1-ALPHA-2-SNAPSHOT 5bd725d04573
[INFO]      [echo] Java Version: 17.0.1 -source 11 -target 11 -release 11
[INFO] Executed tasks
[INFO] 
[INFO] --- jacoco-maven-plugin:0.8.7:prepare-agent (prepare-agent) @ it-tidalwave-bluemarine2-musicbrainz-datamodel ---
[INFO] Skipping JaCoCo execution because property jacoco.skip is set.
[INFO] 
[INFO] --- jaxb2-maven-plugin:2.5.0:xjc (default) @ it-tidalwave-bluemarine2-musicbrainz-datamodel ---
[INFO] Created EpisodePath [/var/jenkins_home/jobs/blueMarine2_Metrics_OpenJDK_17/workspace/modules/MusicBrainzDataModel/target/generated-sources/jaxb/META-INF/JAXB]: true
[INFO] Ignored given or default xjbSources [/var/jenkins_home/jobs/blueMarine2_Metrics_OpenJDK_17/workspace/modules/MusicBrainzDataModel/src/main/xjb], since it is not an existent file or directory.
[INFO] Created EpisodePath [/var/jenkins_home/jobs/blueMarine2_Metrics_OpenJDK_17/workspace/modules/MusicBrainzDataModel/target/generated-sources/jaxb/META-INF/JAXB]: true
[INFO] 
[INFO] --- maven-resources-plugin:3.2.0:resources (default-resources) @ it-tidalwave-bluemarine2-musicbrainz-datamodel ---
[INFO] Using 'UTF-8' encoding to copy filtered resources.
[INFO] Using 'UTF-8' encoding to copy filtered properties files.
[INFO] skip non existing resourceDirectory /var/jenkins_home/jobs/blueMarine2_Metrics_OpenJDK_17/workspace/modules/MusicBrainzDataModel/src/main/resources
[INFO] Copying 1 resource
[INFO] Copying 1 resource
[INFO] 
[INFO] --- maven-compiler-plugin:3.8.1:compile (default-compile) @ it-tidalwave-bluemarine2-musicbrainz-datamodel ---
[INFO] Changes detected - recompiling the module!
[INFO] Compiling 80 source files to /var/jenkins_home/jobs/blueMarine2_Metrics_OpenJDK_17/workspace/modules/MusicBrainzDataModel/target/classes
[INFO] 
[INFO] --- maven-resources-plugin:3.2.0:testResources (default-testResources) @ it-tidalwave-bluemarine2-musicbrainz-datamodel ---
[INFO] Using 'UTF-8' encoding to copy filtered resources.
[INFO] Using 'UTF-8' encoding to copy filtered properties files.
[INFO] skip non existing resourceDirectory /var/jenkins_home/jobs/blueMarine2_Metrics_OpenJDK_17/workspace/modules/MusicBrainzDataModel/src/test/resources
[INFO] 
[INFO] --- maven-compiler-plugin:3.8.1:testCompile (default-testCompile) @ it-tidalwave-bluemarine2-musicbrainz-datamodel ---
[INFO] No sources to compile
[INFO] 
[INFO] --- maven-surefire-plugin:3.0.0-M5:test (default-test) @ it-tidalwave-bluemarine2-musicbrainz-datamodel ---
[INFO] Tests are skipped.
[INFO] 
[INFO] --- jacoco-maven-plugin:0.8.7:report (report) @ it-tidalwave-bluemarine2-musicbrainz-datamodel ---
[INFO] Skipping JaCoCo execution because property jacoco.skip is set.
[INFO] 
[INFO] --- maven-jar-plugin:3.2.0:jar (default-jar) @ it-tidalwave-bluemarine2-musicbrainz-datamodel ---
[INFO] Building jar: /var/jenkins_home/jobs/blueMarine2_Metrics_OpenJDK_17/workspace/modules/MusicBrainzDataModel/target/it-tidalwave-bluemarine2-musicbrainz-datamodel-1.1-ALPHA-2-SNAPSHOT.5bd725d04573.jar
[INFO] 
[INFO] --- maven-jar-plugin:3.2.0:test-jar (default-test-jar) @ it-tidalwave-bluemarine2-musicbrainz-datamodel ---
[INFO] Skipping packaging of the test-jar
[INFO] 
[INFO] --- maven-install-plugin:3.0.0-M1:install (default-install) @ it-tidalwave-bluemarine2-musicbrainz-datamodel ---
[INFO] Installing /var/jenkins_home/jobs/blueMarine2_Metrics_OpenJDK_17/workspace/modules/MusicBrainzDataModel/target/it-tidalwave-bluemarine2-musicbrainz-datamodel-1.1-ALPHA-2-SNAPSHOT.5bd725d04573.jar to /var/jenkins_home/jobs/blueMarine2_Metrics_OpenJDK_17/workspace@tmp/repository/it/tidalwave/bluemarine2/it-tidalwave-bluemarine2-musicbrainz-datamodel/1.1-ALPHA-2-SNAPSHOT/it-tidalwave-bluemarine2-musicbrainz-datamodel-1.1-ALPHA-2-SNAPSHOT.jar
[INFO] Installing /var/jenkins_home/jobs/blueMarine2_Metrics_OpenJDK_17/workspace/modules/MusicBrainzDataModel/pom.xml to /var/jenkins_home/jobs/blueMarine2_Metrics_OpenJDK_17/workspace@tmp/repository/it/tidalwave/bluemarine2/it-tidalwave-bluemarine2-musicbrainz-datamodel/1.1-ALPHA-2-SNAPSHOT/it-tidalwave-bluemarine2-musicbrainz-datamodel-1.1-ALPHA-2-SNAPSHOT.pom
[INFO] 
[INFO] >>> maven-dependency-plugin:3.1.2:analyze (default-cli) > test-compile @ it-tidalwave-bluemarine2-musicbrainz-datamodel >>>
[INFO] 
[INFO] --- buildnumber-maven-plugin:1.4:create (default) @ it-tidalwave-bluemarine2-musicbrainz-datamodel ---
[INFO] ShortRevision tag detected. The value is '12'.
[INFO] Executing: /bin/sh -c cd '/var/jenkins_home/jobs/blueMarine2_Metrics_OpenJDK_17/workspace/modules/MusicBrainzDataModel' && 'git' 'rev-parse' '--verify' '--short=12' 'HEAD'
[INFO] Working directory: /var/jenkins_home/jobs/blueMarine2_Metrics_OpenJDK_17/workspace/modules/MusicBrainzDataModel
[INFO] Storing buildNumber: 5bd725d04573 at timestamp: 1659932306726
[WARNING] Cannot get the branch information from the git repository: 
Detecting the current branch failed: fatal: ref HEAD is not a symbolic ref

[INFO] ShortRevision tag detected. The value is '12'.
[INFO] Executing: /bin/sh -c cd '/var/jenkins_home/jobs/blueMarine2_Metrics_OpenJDK_17/workspace/modules/MusicBrainzDataModel' && 'git' 'rev-parse' '--verify' '--short=12' 'HEAD'
[INFO] Working directory: /var/jenkins_home/jobs/blueMarine2_Metrics_OpenJDK_17/workspace/modules/MusicBrainzDataModel
[INFO] Storing buildScmBranch: UNKNOWN
[INFO] 
[INFO] --- maven-enforcer-plugin:3.0.0-M3:enforce (enforce-maven) @ it-tidalwave-bluemarine2-musicbrainz-datamodel ---
[INFO] 
[INFO] --- maven-enforcer-plugin:3.0.0-M3:enforce (enforce-banned-dependencies) @ it-tidalwave-bluemarine2-musicbrainz-datamodel ---
[INFO] 
[INFO] --- maven-antrun-plugin:3.0.0:run (generate-and-print-build-description) @ it-tidalwave-bluemarine2-musicbrainz-datamodel ---
[INFO] Executing tasks
[INFO]      [echo] DESCRIPTION: origin/master 1.1-ALPHA-2-SNAPSHOT 5bd725d04573
[INFO]      [echo] Java Version: 17.0.1 -source 11 -target 11 -release 11
[INFO] Executed tasks
[INFO] 
[INFO] --- jacoco-maven-plugin:0.8.7:prepare-agent (prepare-agent) @ it-tidalwave-bluemarine2-musicbrainz-datamodel ---
[INFO] Skipping JaCoCo execution because property jacoco.skip is set.
[INFO] 
[INFO] --- jaxb2-maven-plugin:2.5.0:xjc (default) @ it-tidalwave-bluemarine2-musicbrainz-datamodel ---
[INFO] Ignored given or default xjbSources [/var/jenkins_home/jobs/blueMarine2_Metrics_OpenJDK_17/workspace/modules/MusicBrainzDataModel/src/main/xjb], since it is not an existent file or directory.
[INFO] No changes detected in schema or binding files - skipping JAXB generation.
[INFO] 
[INFO] --- maven-resources-plugin:3.2.0:resources (default-resources) @ it-tidalwave-bluemarine2-musicbrainz-datamodel ---
[INFO] Using 'UTF-8' encoding to copy filtered resources.
[INFO] Using 'UTF-8' encoding to copy filtered properties files.
[INFO] skip non existing resourceDirectory /var/jenkins_home/jobs/blueMarine2_Metrics_OpenJDK_17/workspace/modules/MusicBrainzDataModel/src/main/resources
[INFO] Copying 1 resource
[INFO] Copying 1 resource
[INFO] 
[INFO] --- maven-compiler-plugin:3.8.1:compile (default-compile) @ it-tidalwave-bluemarine2-musicbrainz-datamodel ---
[INFO] Changes detected - recompiling the module!
[INFO] Compiling 80 source files to /var/jenkins_home/jobs/blueMarine2_Metrics_OpenJDK_17/workspace/modules/MusicBrainzDataModel/target/classes
[INFO] 
[INFO] --- maven-resources-plugin:3.2.0:testResources (default-testResources) @ it-tidalwave-bluemarine2-musicbrainz-datamodel ---
[INFO] Using 'UTF-8' encoding to copy filtered resources.
[INFO] Using 'UTF-8' encoding to copy filtered properties files.
[INFO] skip non existing resourceDirectory /var/jenkins_home/jobs/blueMarine2_Metrics_OpenJDK_17/workspace/modules/MusicBrainzDataModel/src/test/resources
[INFO] 
[INFO] --- maven-compiler-plugin:3.8.1:testCompile (default-testCompile) @ it-tidalwave-bluemarine2-musicbrainz-datamodel ---
[INFO] No sources to compile
[WARNING] Failed to getClass for org.apache.maven.plugins.dependency.analyze.AnalyzeMojo
[INFO] 
[INFO] <<< maven-dependency-plugin:3.1.2:analyze (default-cli) < test-compile @ it-tidalwave-bluemarine2-musicbrainz-datamodel <<<
[INFO] 
[INFO] 
[INFO] --- maven-dependency-plugin:3.1.2:analyze (default-cli) @ it-tidalwave-bluemarine2-musicbrainz-datamodel ---
[WARNING] Unused declared dependencies found:
[WARNING]    com.sun.xml.bind:jaxb-impl:jar:3.0.0:runtime
[WARNING]    javax.inject:javax.inject:jar:1:compile
[WARNING]    org.slf4j:slf4j-api:jar:1.7.30:compile
[WARNING]    org.projectlombok:lombok:jar:1.18.22:provided
[WARNING]    org.slf4j:jcl-over-slf4j:jar:1.7.30:runtime
[WARNING]    org.slf4j:jul-to-slf4j:jar:1.7.30:runtime
[WARNING]    ch.qos.logback:logback-classic:jar:1.2.3:runtime
[WARNING]    it.tidalwave.thesefoolishthings:it-tidalwave-util-test:jar:3.2-ALPHA-11:test
[WARNING]    org.testng:testng:jar:6.9.10:test
[WARNING]    org.hamcrest:hamcrest-all:jar:1.3:test
[WARNING]    org.mockito:mockito-core:jar:3.8.0:test
[JENKINS] Archiving disabled
Started calculate disk usage of build
Finished Calculation of disk usage of build in 0 seconds
Started calculate disk usage of workspace
Finished Calculation of disk usage of workspace in 0 seconds
[INFO] 
[INFO] --< it.tidalwave.bluemarine2:it-tidalwave-bluemarine2-metadata-musicbrainz >--
[INFO] Building blueMarine II :: MusicBrainz 1.1-ALPHA-2-SNAPSHOT       [10/26]
[INFO] --------------------------------[ jar ]---------------------------------
[INFO] 
[INFO] --- maven-clean-plugin:3.1.0:clean (default-clean) @ it-tidalwave-bluemarine2-metadata-musicbrainz ---
[INFO] 
[INFO] --- buildnumber-maven-plugin:1.4:create (default) @ it-tidalwave-bluemarine2-metadata-musicbrainz ---
[INFO] ShortRevision tag detected. The value is '12'.
[INFO] Executing: /bin/sh -c cd '/var/jenkins_home/jobs/blueMarine2_Metrics_OpenJDK_17/workspace/modules/MusicBrainz' && 'git' 'rev-parse' '--verify' '--short=12' 'HEAD'
[INFO] Working directory: /var/jenkins_home/jobs/blueMarine2_Metrics_OpenJDK_17/workspace/modules/MusicBrainz
[INFO] Storing buildNumber: 5bd725d04573 at timestamp: 1659932318620
[WARNING] Cannot get the branch information from the git repository: 
Detecting the current branch failed: fatal: ref HEAD is not a symbolic ref

[INFO] ShortRevision tag detected. The value is '12'.
[INFO] Executing: /bin/sh -c cd '/var/jenkins_home/jobs/blueMarine2_Metrics_OpenJDK_17/workspace/modules/MusicBrainz' && 'git' 'rev-parse' '--verify' '--short=12' 'HEAD'
[INFO] Working directory: /var/jenkins_home/jobs/blueMarine2_Metrics_OpenJDK_17/workspace/modules/MusicBrainz
[INFO] Storing buildScmBranch: UNKNOWN
[INFO] 
[INFO] --- maven-enforcer-plugin:3.0.0-M3:enforce (enforce-maven) @ it-tidalwave-bluemarine2-metadata-musicbrainz ---
[INFO] 
[INFO] --- maven-enforcer-plugin:3.0.0-M3:enforce (enforce-banned-dependencies) @ it-tidalwave-bluemarine2-metadata-musicbrainz ---
[INFO] 
[INFO] --- maven-antrun-plugin:3.0.0:run (generate-and-print-build-description) @ it-tidalwave-bluemarine2-metadata-musicbrainz ---
[INFO] Executing tasks
[INFO]      [echo] DESCRIPTION: origin/master 1.1-ALPHA-2-SNAPSHOT 5bd725d04573
[INFO]      [echo] Java Version: 17.0.1 -source 11 -target 11 -release 11
[INFO] Executed tasks
[INFO] 
[INFO] --- jacoco-maven-plugin:0.8.7:prepare-agent (prepare-agent) @ it-tidalwave-bluemarine2-metadata-musicbrainz ---
[INFO] tft.test.jacoco.argLine set to -javaagent:/var/jenkins_home/jobs/blueMarine2_Metrics_OpenJDK_17/workspace@tmp/repository/org/jacoco/org.jacoco.agent/0.8.7/org.jacoco.agent-0.8.7-runtime.jar=destfile=/var/jenkins_home/jobs/blueMarine2_Metrics_OpenJDK_17/workspace/modules/MusicBrainz/target/jacoco.exec
[INFO] 
[INFO] --- maven-resources-plugin:3.2.0:resources (default-resources) @ it-tidalwave-bluemarine2-metadata-musicbrainz ---
[INFO] Using 'UTF-8' encoding to copy filtered resources.
[INFO] Using 'UTF-8' encoding to copy filtered properties files.
[INFO] skip non existing resourceDirectory /var/jenkins_home/jobs/blueMarine2_Metrics_OpenJDK_17/workspace/modules/MusicBrainz/src/main/resources
[INFO] 
[INFO] --- maven-compiler-plugin:3.8.1:compile (default-compile) @ it-tidalwave-bluemarine2-metadata-musicbrainz ---
[INFO] Changes detected - recompiling the module!
[INFO] Compiling 9 source files to /var/jenkins_home/jobs/blueMarine2_Metrics_OpenJDK_17/workspace/modules/MusicBrainz/target/classes
[WARNING] No processor claimed any of these annotations: /javax.annotation.Nullable,/javax.annotation.Nonnegative,/javax.annotation.Nonnull,/javax.annotation.concurrent.Immutable
[INFO] 
[INFO] --- maven-dependency-plugin:3.1.2:unpack (default) @ it-tidalwave-bluemarine2-metadata-musicbrainz ---
[INFO] Configured Artifact: it.tidalwave.bluemarine2.testsets:expected-metadata-iTunes-fg-20160504-2:5:zip
[INFO] Configured Artifact: it.tidalwave.bluemarine2.testsets:expected-metadata-iTunes-fg-20161210-1:2:zip
[INFO] Configured Artifact: it.tidalwave.bluemarine2.testsets:expected-metadata-iTunes-aac-fg-20170131-1:3:zip
[INFO] Configured Artifact: it.tidalwave.bluemarine2.testsets:expected-metadata-amazon-autorip-fg-20170131-1:3:zip
[INFO] Configured Artifact: it.tidalwave.bluemarine2.testsets:musicbrainz-cddb-cache-iTunes-fg-20160504-2:20170123_1415:zip
[INFO] Configured Artifact: it.tidalwave.bluemarine2.testsets:musicbrainz-cddb-cache-iTunes-fg-20161210-1:20170123_1415:zip
[INFO] Configured Artifact: it.tidalwave.bluemarine2.testsets:musicbrainz-cache-iTunes-fg-20160504-2:20170123_1415:zip
[INFO] Configured Artifact: it.tidalwave.bluemarine2.testsets:musicbrainz-cache-iTunes-fg-20161210-1:20170123_1415:zip
[INFO] Configured Artifact: it.tidalwave.bluemarine2.testsets:expected-metadata-musicbrainz-cddb-iTunes-fg-20160504-2:20170123_1415:zip
[INFO] Configured Artifact: it.tidalwave.bluemarine2.testsets:expected-metadata-musicbrainz-cddb-iTunes-fg-20161210-1:20170123_1415:zip
[INFO] Configured Artifact: it.tidalwave.bluemarine2.testsets:expected-metadata-musicbrainz-iTunes-fg-20160504-2:20170126_1435:zip
[INFO] Configured Artifact: it.tidalwave.bluemarine2.testsets:expected-metadata-musicbrainz-iTunes-fg-20161210-1:20210408_2135:zip
[INFO] Unpacking /var/jenkins_home/jobs/blueMarine2_Metrics_OpenJDK_17/workspace@tmp/repository/it/tidalwave/bluemarine2/testsets/expected-metadata-iTunes-fg-20160504-2/5/expected-metadata-iTunes-fg-20160504-2-5.zip to /var/jenkins_home/jobs/blueMarine2_Metrics_OpenJDK_17/workspace/modules/MusicBrainz/target/metadata with includes "" and excludes ""
[INFO] Unpacking /var/jenkins_home/jobs/blueMarine2_Metrics_OpenJDK_17/workspace@tmp/repository/it/tidalwave/bluemarine2/testsets/expected-metadata-iTunes-fg-20161210-1/2/expected-metadata-iTunes-fg-20161210-1-2.zip to /var/jenkins_home/jobs/blueMarine2_Metrics_OpenJDK_17/workspace/modules/MusicBrainz/target/metadata with includes "" and excludes ""
[INFO] Unpacking /var/jenkins_home/jobs/blueMarine2_Metrics_OpenJDK_17/workspace@tmp/repository/it/tidalwave/bluemarine2/testsets/expected-metadata-iTunes-aac-fg-20170131-1/3/expected-metadata-iTunes-aac-fg-20170131-1-3.zip to /var/jenkins_home/jobs/blueMarine2_Metrics_OpenJDK_17/workspace/modules/MusicBrainz/target/metadata with includes "" and excludes ""
[INFO] Unpacking /var/jenkins_home/jobs/blueMarine2_Metrics_OpenJDK_17/workspace@tmp/repository/it/tidalwave/bluemarine2/testsets/expected-metadata-amazon-autorip-fg-20170131-1/3/expected-metadata-amazon-autorip-fg-20170131-1-3.zip to /var/jenkins_home/jobs/blueMarine2_Metrics_OpenJDK_17/workspace/modules/MusicBrainz/target/metadata with includes "" and excludes ""
[INFO] Unpacking /var/jenkins_home/jobs/blueMarine2_Metrics_OpenJDK_17/workspace@tmp/repository/it/tidalwave/bluemarine2/testsets/musicbrainz-cddb-cache-iTunes-fg-20160504-2/20170123_1415/musicbrainz-cddb-cache-iTunes-fg-20160504-2-20170123_1415.zip to /var/jenkins_home/jobs/blueMarine2_Metrics_OpenJDK_17/workspace/modules/MusicBrainz/target/cache/cddb with includes "" and excludes ""
[INFO] Unpacking /var/jenkins_home/jobs/blueMarine2_Metrics_OpenJDK_17/workspace@tmp/repository/it/tidalwave/bluemarine2/testsets/musicbrainz-cddb-cache-iTunes-fg-20161210-1/20170123_1415/musicbrainz-cddb-cache-iTunes-fg-20161210-1-20170123_1415.zip to /var/jenkins_home/jobs/blueMarine2_Metrics_OpenJDK_17/workspace/modules/MusicBrainz/target/cache/cddb with includes "" and excludes ""
[INFO] Unpacking /var/jenkins_home/jobs/blueMarine2_Metrics_OpenJDK_17/workspace@tmp/repository/it/tidalwave/bluemarine2/testsets/musicbrainz-cache-iTunes-fg-20160504-2/20170123_1415/musicbrainz-cache-iTunes-fg-20160504-2-20170123_1415.zip to /var/jenkins_home/jobs/blueMarine2_Metrics_OpenJDK_17/workspace/modules/MusicBrainz/target/cache/musicbrainz with includes "" and excludes ""
[INFO] Unpacking /var/jenkins_home/jobs/blueMarine2_Metrics_OpenJDK_17/workspace@tmp/repository/it/tidalwave/bluemarine2/testsets/musicbrainz-cache-iTunes-fg-20161210-1/20170123_1415/musicbrainz-cache-iTunes-fg-20161210-1-20170123_1415.zip to /var/jenkins_home/jobs/blueMarine2_Metrics_OpenJDK_17/workspace/modules/MusicBrainz/target/cache/musicbrainz with includes "" and excludes ""
[JENKINS] Archiving disabled
[JENKINS] Archiving disabled
[JENKINS] Archiving disabled
[JENKINS] Archiving disabled
[JENKINS] Archiving disabled
[JENKINS] Archiving disabled
[JENKINS] Archiving disabled
[JENKINS] Archiving disabled
[JENKINS] Archiving disabled
[JENKINS] Archiving disabled
[JENKINS] Archiving disabled
[JENKINS] Archiving disabled
[JENKINS] Archiving disabled
[JENKINS] Archiving disabled
[INFO] ------------------------------------------------------------------------
[JENKINS] Archiving disabled
[INFO] Reactor Summary for blueMarine II 1.1-ALPHA-2-SNAPSHOT:
[INFO] 
[INFO] blueMarine II ...................................... SUCCESS [ 10.511 s]
[INFO] blueMarine II (modules) ............................ SUCCESS [  1.981 s]
[INFO] blueMarine II :: Commons ........................... SUCCESS [ 55.108 s]
[INFO] blueMarine II :: Capture One 11 Applescript ........ SUCCESS [ 30.050 s]
[INFO] blueMarine II :: Commons for Tests ................. SUCCESS [ 13.885 s]
[INFO] blueMarine II :: Model ............................. SUCCESS [03:16 min]
[INFO] blueMarine II :: Persistence ....................... SUCCESS [01:07 min]
[INFO] blueMarine II :: Vocabulary ........................ SUCCESS [ 16.540 s]
[INFO] blueMarine II :: MusicBrainz :: Data Model ......... SUCCESS [ 28.057 s]
[INFO] blueMarine II :: MusicBrainz ....................... FAILURE [ 37.378 s]
[INFO] blueMarine II :: Media Scanner ..................... SKIPPED
[INFO] blueMarine II :: Catalog ........................... SKIPPED
[INFO] blueMarine II :: Downloader ........................ SKIPPED
[INFO] blueMarine II :: UI ................................ SKIPPED
[INFO] blueMarine II :: UI :: JavaFX ...................... SKIPPED
[INFO] blueMarine II :: CEC :: Adapter .................... SKIPPED
[INFO] blueMarine II :: CEC :: Navigation Adapter ......... SKIPPED
[INFO] blueMarine II :: Media Server ...................... SKIPPED
[INFO] blueMarine II :: Media Server :: REST .............. SKIPPED
[INFO] blueMarine II :: Media Server :: UPnP .............. SKIPPED
[INFO] blueMarine II :: Initializer ....................... SKIPPED
[INFO] blueMarine II :: Services (modules) ................ SKIPPED
[INFO] blueMarine II :: Services :: StoppingDown .......... SKIPPED
[INFO] blueMarine II :: Headless Service .................. SKIPPED
[INFO] blueMarine II :: Application :: JavaFX ............. SKIPPED
[INFO] blueMarine II :: Plugins (modules) ................. SKIPPED
[INFO] ------------------------------------------------------------------------
[INFO] BUILD FAILURE
[INFO] ------------------------------------------------------------------------
[INFO] Total time:  07:56 min
[INFO] Finished at: 2022-08-08T04:19:19Z
[INFO] ------------------------------------------------------------------------
[ERROR] Failed to execute goal org.apache.maven.plugins:maven-dependency-plugin:3.1.2:unpack (default) on project it-tidalwave-bluemarine2-metadata-musicbrainz: Error unpacking file: /var/jenkins_home/jobs/blueMarine2_Metrics_OpenJDK_17/workspace@tmp/repository/it/tidalwave/bluemarine2/testsets/musicbrainz-cache-iTunes-fg-20161210-1/20170123_1415/musicbrainz-cache-iTunes-fg-20161210-1-20170123_1415.zip to: /var/jenkins_home/jobs/blueMarine2_Metrics_OpenJDK_17/workspace/modules/MusicBrainz/target/cache/musicbrainz
[ERROR] org.codehaus.plexus.archiver.ArchiverException: Error while expanding /var/jenkins_home/jobs/blueMarine2_Metrics_OpenJDK_17/workspace@tmp/repository/it/tidalwave/bluemarine2/testsets/musicbrainz-cache-iTunes-fg-20161210-1/20170123_1415/musicbrainz-cache-iTunes-fg-20161210-1-20170123_1415.zip: No space left on device
[ERROR] -> [Help 1]
[ERROR] 
[ERROR] To see the full stack trace of the errors, re-run Maven with the -e switch.
[ERROR] Re-run Maven using the -X switch to enable full debug logging.
[ERROR] 
[ERROR] For more information about the errors and possible solutions, please read the following articles:
[ERROR] [Help 1] http://cwiki.apache.org/confluence/display/MAVEN/MojoExecutionException
[ERROR] 
[ERROR] After correcting the problems, you can resume the build with the command
[ERROR]   mvn <goals> -rf :it-tidalwave-bluemarine2-metadata-musicbrainz
[INFO] ------------------------------------------------------------------------
[INFO] Reactor Build Order:
[INFO] 
[INFO] blueMarine II                                                      [pom]
[INFO] blueMarine II (modules)                                            [pom]
[INFO] blueMarine II :: Commons                                           [jar]
[INFO] blueMarine II :: Capture One 11 Applescript                        [jar]
[INFO] blueMarine II :: Commons for Tests                                 [jar]
[INFO] blueMarine II :: Model                                             [jar]
[INFO] blueMarine II :: Persistence                                       [jar]
[INFO] blueMarine II :: Vocabulary                                        [jar]
[INFO] blueMarine II :: MusicBrainz :: Data Model                         [jar]
[INFO] blueMarine II :: MusicBrainz                                       [jar]
[INFO] blueMarine II :: Media Scanner                                     [jar]
[INFO] blueMarine II :: Catalog                                           [jar]
[INFO] blueMarine II :: Downloader                                        [jar]
[INFO] blueMarine II :: UI                                                [jar]
[INFO] blueMarine II :: UI :: JavaFX                                      [jar]
[INFO] blueMarine II :: CEC :: Adapter                                    [jar]
[INFO] blueMarine II :: CEC :: Navigation Adapter                         [jar]
[INFO] blueMarine II :: Media Server                                      [jar]
[INFO] blueMarine II :: Media Server :: REST                              [jar]
[INFO] blueMarine II :: Media Server :: UPnP                              [jar]
[INFO] blueMarine II :: Initializer                                       [jar]
[INFO] blueMarine II :: Services (modules)                                [pom]
[INFO] blueMarine II :: Services :: StoppingDown                          [jar]
[INFO] blueMarine II :: Headless Service                                  [jar]
[INFO] blueMarine II :: Application :: JavaFX                             [jar]
[INFO] blueMarine II :: Plugins (modules)                                 [pom]
[INFO] 
[INFO] ----------------< it.tidalwave.bluemarine2:bluemarine2 >----------------
[INFO] Building blueMarine II 1.1-ALPHA-2-SNAPSHOT                       [1/26]
[INFO] --------------------------------[ pom ]---------------------------------
[INFO] 
[INFO] --- maven-site-plugin:3.9.1:site (default-site) @ bluemarine2 ---
[INFO] configuring report plugin org.apache.maven.plugins:maven-project-info-reports-plugin:3.1.1
[INFO] 16 reports configured for maven-project-info-reports-plugin:3.1.1: ci-management, dependencies, dependency-convergence, dependency-info, dependency-management, distribution-management, index, issue-management, licenses, mailing-lists, modules, plugin-management, plugins, scm, summary, team
[INFO] configuring report plugin org.apache.maven.plugins:maven-surefire-report-plugin:3.0.0-M5
[INFO] 1 report configured for maven-surefire-report-plugin:3.0.0-M5: report-only
[INFO] configuring report plugin org.jacoco:jacoco-maven-plugin:0.8.7
[INFO] 1 report configured for jacoco-maven-plugin:0.8.7: report-aggregate
[INFO] configuring report plugin com.github.spotbugs:spotbugs-maven-plugin:4.5.0.0
[INFO] 1 report configured for spotbugs-maven-plugin:4.5.0.0: spotbugs
[INFO] configuring report plugin org.apache.maven.plugins:maven-pmd-plugin:3.14.0
[INFO] 2 reports configured for maven-pmd-plugin:3.14.0: pmd, cpd
[INFO] configuring report plugin org.apache.maven.plugins:maven-checkstyle-plugin:3.0.0
[INFO] 2 reports detected for maven-checkstyle-plugin:3.0.0: checkstyle, checkstyle-aggregate
[INFO] configuring report plugin org.owasp:dependency-check-maven:6.1.1
[INFO] 1 report configured for dependency-check-maven:6.1.1: aggregate
[INFO] configuring report plugin org.apache.maven.plugins:maven-javadoc-plugin:3.2.0
[INFO] 2 reports configured for maven-javadoc-plugin:3.2.0: javadoc-no-fork, test-javadoc-no-fork
[WARNING] Unable to locate Source XRef to link to - DISABLED
[WARNING] Unable to locate Source XRef to link to - DISABLED
[WARNING] Unable to locate Source XRef to link to - DISABLED
[WARNING] Unable to locate Source XRef to link to - DISABLED
[WARNING] Unable to locate Source XRef to link to - DISABLED
[WARNING] Unable to locate Source XRef to link to - DISABLED
[WARNING] Unable to locate Source XRef to link to - DISABLED
[WARNING] Unable to locate Source XRef to link to - DISABLED
[WARNING] Unable to locate Source XRef to link to - DISABLED
[WARNING] Unable to locate Source XRef to link to - DISABLED
[WARNING] Unable to locate Source XRef to link to - DISABLED
[WARNING] Unable to locate Source XRef to link to - DISABLED
[WARNING] Unable to locate Source XRef to link to - DISABLED
[WARNING] Unable to locate Source XRef to link to - DISABLED
[WARNING] Unable to locate Source XRef to link to - DISABLED
[WARNING] Unable to locate Source XRef to link to - DISABLED
[WARNING] Unable to locate Source XRef to link to - DISABLED
[WARNING] Unable to locate Source XRef to link to - DISABLED
[WARNING] Unable to locate Source XRef to link to - DISABLED
[WARNING] Unable to locate Source XRef to link to - DISABLED
[WARNING] Unable to locate Source XRef to link to - DISABLED
[WARNING] The project bluemarine2-modules does not seem to be compiled. PMD results might be inaccurate.
[INFO] Downloading from maven-proxy.tidalwave.it: https://services.tidalwave.it/nexus/content/groups/public/it/tidalwave/bluemarine2/it-tidalwave-bluemarine2-metadata-musicbrainz/1.1-ALPHA-2-SNAPSHOT/maven-metadata.xml
[INFO] Downloading from maven-proxy.tidalwave.it: https://services.tidalwave.it/nexus/content/groups/public/it/tidalwave/bluemarine2/it-tidalwave-bluemarine2-mediascanner/1.1-ALPHA-2-SNAPSHOT/maven-metadata.xml
[WARNING] The project it-tidalwave-bluemarine2-mediascanner does not seem to be compiled. PMD results might be inaccurate.
[INFO] Downloading from maven-proxy.tidalwave.it: https://services.tidalwave.it/nexus/content/groups/public/it/tidalwave/bluemarine2/it-tidalwave-bluemarine2-catalog/1.1-ALPHA-2-SNAPSHOT/maven-metadata.xml
[WARNING] The project it-tidalwave-bluemarine2-catalog does not seem to be compiled. PMD results might be inaccurate.
[INFO] Downloading from maven-proxy.tidalwave.it: https://services.tidalwave.it/nexus/content/groups/public/it/tidalwave/bluemarine2/it-tidalwave-bluemarine2-downloader/1.1-ALPHA-2-SNAPSHOT/maven-metadata.xml
[WARNING] The project it-tidalwave-bluemarine2-downloader does not seem to be compiled. PMD results might be inaccurate.
[INFO] Downloading from maven-proxy.tidalwave.it: https://services.tidalwave.it/nexus/content/groups/public/it/tidalwave/bluemarine2/it-tidalwave-bluemarine2-ui/1.1-ALPHA-2-SNAPSHOT/maven-metadata.xml
[WARNING] The project it-tidalwave-bluemarine2-ui does not seem to be compiled. PMD results might be inaccurate.
[INFO] Downloading from maven-proxy.tidalwave.it: https://services.tidalwave.it/nexus/content/groups/public/it/tidalwave/bluemarine2/it-tidalwave-bluemarine2-ui-javafx/1.1-ALPHA-2-SNAPSHOT/maven-metadata.xml
[WARNING] The project it-tidalwave-bluemarine2-ui-javafx does not seem to be compiled. PMD results might be inaccurate.
[INFO] Downloading from maven-proxy.tidalwave.it: https://services.tidalwave.it/nexus/content/groups/public/it/tidalwave/bluemarine2/it-tidalwave-cec/1.1-ALPHA-2-SNAPSHOT/maven-metadata.xml
[WARNING] The project it-tidalwave-cec does not seem to be compiled. PMD results might be inaccurate.
[INFO] Downloading from maven-proxy.tidalwave.it: https://services.tidalwave.it/nexus/content/groups/public/it/tidalwave/bluemarine2/it-tidalwave-bluemarine2-cecnavigationadapter/1.1-ALPHA-2-SNAPSHOT/maven-metadata.xml
[WARNING] The project it-tidalwave-bluemarine2-cecnavigationadapter does not seem to be compiled. PMD results might be inaccurate.
[INFO] Downloading from maven-proxy.tidalwave.it: https://services.tidalwave.it/nexus/content/groups/public/it/tidalwave/bluemarine2/it-tidalwave-bluemarine2-mediaserver/1.1-ALPHA-2-SNAPSHOT/maven-metadata.xml
[WARNING] The project it-tidalwave-bluemarine2-mediaserver does not seem to be compiled. PMD results might be inaccurate.
[INFO] Downloading from maven-proxy.tidalwave.it: https://services.tidalwave.it/nexus/content/groups/public/it/tidalwave/bluemarine2/it-tidalwave-bluemarine2-rest/1.1-ALPHA-2-SNAPSHOT/maven-metadata.xml
[WARNING] The project it-tidalwave-bluemarine2-rest does not seem to be compiled. PMD results might be inaccurate.
[INFO] Downloading from maven-proxy.tidalwave.it: https://services.tidalwave.it/nexus/content/groups/public/it/tidalwave/bluemarine2/it-tidalwave-bluemarine2-upnp-mediaserver/1.1-ALPHA-2-SNAPSHOT/maven-metadata.xml
[WARNING] The project it-tidalwave-bluemarine2-upnp-mediaserver does not seem to be compiled. PMD results might be inaccurate.
[INFO] Downloading from maven-proxy.tidalwave.it: https://services.tidalwave.it/nexus/content/groups/public/it/tidalwave/bluemarine2/it-tidalwave-bluemarine2-initializer/1.1-ALPHA-2-SNAPSHOT/maven-metadata.xml
[WARNING] The project it-tidalwave-bluemarine2-initializer does not seem to be compiled. PMD results might be inaccurate.
[WARNING] The project bluemarine2-services-modules does not seem to be compiled. PMD results might be inaccurate.
[INFO] Downloading from maven-proxy.tidalwave.it: https://services.tidalwave.it/nexus/content/groups/public/it/tidalwave/bluemarine2/it-tidalwave-bluemarine2-services-stoppingdown/1.1-ALPHA-2-SNAPSHOT/maven-metadata.xml
[WARNING] The project it-tidalwave-bluemarine2-services-stoppingdown does not seem to be compiled. PMD results might be inaccurate.
[INFO] Downloading from maven-proxy.tidalwave.it: https://services.tidalwave.it/nexus/content/groups/public/it/tidalwave/bluemarine2/it-tidalwave-bluemarine2-headlessservice/1.1-ALPHA-2-SNAPSHOT/maven-metadata.xml
[WARNING] The project it-tidalwave-bluemarine2-headlessservice does not seem to be compiled. PMD results might be inaccurate.
[INFO] Downloading from maven-proxy.tidalwave.it: https://services.tidalwave.it/nexus/content/groups/public/it/tidalwave/bluemarine2/it-tidalwave-bluemarine2-application-javafx/1.1-ALPHA-2-SNAPSHOT/maven-metadata.xml
[WARNING] The project it-tidalwave-bluemarine2-application-javafx does not seem to be compiled. PMD results might be inaccurate.
[WARNING] The project bluemarine2-plugins-modules does not seem to be compiled. PMD results might be inaccurate.
Aug 08, 2022 4:19:43 AM net.sourceforge.pmd.RuleSetFactoryCompatibility$RuleSetFilter apply
WARNING: Applying rule set filter: The rule "UnusedModifier" has been moved from ruleset "unusedcode" to "unnecessary". Please change your ruleset!
Aug 08, 2022 4:19:43 AM net.sourceforge.pmd.RuleSetFactoryCompatibility$RuleSetFilter apply
WARNING: Applying rule set filter: The rule "UnusedModifier" has been renamed to "UnnecessaryModifier". Please change your ruleset!
Aug 08, 2022 4:19:44 AM net.sourceforge.pmd.RuleSetFactory parseRuleSetReferenceNode
WARNING: The RuleSet rulesets/java/basic.xml has been deprecated and will be removed in PMD 7.0.0
Aug 08, 2022 4:19:44 AM net.sourceforge.pmd.RuleSetFactory parseRuleSetReferenceNode
WARNING: The RuleSet rulesets/java/unusedcode.xml has been deprecated and will be removed in PMD 7.0.0
Aug 08, 2022 4:19:44 AM net.sourceforge.pmd.RuleSetFactory parseRuleSetReferenceNode
WARNING: The RuleSet rulesets/java/imports.xml has been deprecated and will be removed in PMD 7.0.0
Aug 08, 2022 4:19:44 AM net.sourceforge.pmd.RuleSetFactoryCompatibility$RuleSetFilter apply
WARNING: Applying rule set filter: The rule "UnusedModifier" has been moved from ruleset "unusedcode" to "unnecessary". Please change your ruleset!
Aug 08, 2022 4:19:44 AM net.sourceforge.pmd.RuleSetFactoryCompatibility$RuleSetFilter apply
WARNING: Applying rule set filter: The rule "UnusedModifier" has been renamed to "UnnecessaryModifier". Please change your ruleset!
Aug 08, 2022 4:19:44 AM net.sourceforge.pmd.RuleSetFactory parseRuleSetReferenceNode
WARNING: The RuleSet rulesets/java/basic.xml has been deprecated and will be removed in PMD 7.0.0
Aug 08, 2022 4:19:44 AM net.sourceforge.pmd.RuleSetFactory parseRuleSetReferenceNode
WARNING: The RuleSet rulesets/java/unusedcode.xml has been deprecated and will be removed in PMD 7.0.0
Aug 08, 2022 4:19:44 AM net.sourceforge.pmd.RuleSetFactory parseRuleSetReferenceNode
WARNING: The RuleSet rulesets/java/imports.xml has been deprecated and will be removed in PMD 7.0.0
[WARNING] There are 3 PMD processing errors:
[WARNING] /var/jenkins_home/jobs/blueMarine2_Metrics_OpenJDK_17/workspace/modules/Catalog/src/main/java/it/tidalwave/bluemarine2/model/impl/catalog/finder/RepositoryFinderSupport.java: PMDException: Error while parsing /var/jenkins_home/jobs/blueMarine2_Metrics_OpenJDK_17/workspace/modules/Catalog/src/main/java/it/tidalwave/bluemarine2/model/impl/catalog/finder/RepositoryFinderSupport.java
/var/jenkins_home/jobs/blueMarine2_Metrics_OpenJDK_17/workspace/modules/Commons/src/main/java/it/tidalwave/bluemarine2/util/RdfUtilities.java: PMDException: Error while parsing /var/jenkins_home/jobs/blueMarine2_Metrics_OpenJDK_17/workspace/modules/Commons/src/main/java/it/tidalwave/bluemarine2/util/RdfUtilities.java
/var/jenkins_home/jobs/blueMarine2_Metrics_OpenJDK_17/workspace/modules/Model/src/main/java/it/tidalwave/bluemarine2/model/MediaItem.java: PMDException: Error while parsing /var/jenkins_home/jobs/blueMarine2_Metrics_OpenJDK_17/workspace/modules/Model/src/main/java/it/tidalwave/bluemarine2/model/MediaItem.java
[INFO] ------------------------------------------------------------------------
[INFO] Reactor Summary for blueMarine II 1.1-ALPHA-2-SNAPSHOT:
[INFO] 
[INFO] blueMarine II ...................................... FAILURE [ 24.549 s]
[INFO] blueMarine II (modules) ............................ SKIPPED
[INFO] blueMarine II :: Commons ........................... SKIPPED
[INFO] blueMarine II :: Capture One 11 Applescript ........ SKIPPED
[INFO] blueMarine II :: Commons for Tests ................. SKIPPED
[INFO] blueMarine II :: Model ............................. SKIPPED
[INFO] blueMarine II :: Persistence ....................... SKIPPED
[INFO] blueMarine II :: Vocabulary ........................ SKIPPED
[INFO] blueMarine II :: MusicBrainz :: Data Model ......... SKIPPED
[INFO] blueMarine II :: MusicBrainz ....................... SKIPPED
[INFO] blueMarine II :: Media Scanner ..................... SKIPPED
[INFO] blueMarine II :: Catalog ........................... SKIPPED
[INFO] blueMarine II :: Downloader ........................ SKIPPED
[INFO] blueMarine II :: UI ................................ SKIPPED
[INFO] blueMarine II :: UI :: JavaFX ...................... SKIPPED
[INFO] blueMarine II :: CEC :: Adapter .................... SKIPPED
[INFO] blueMarine II :: CEC :: Navigation Adapter ......... SKIPPED
[INFO] blueMarine II :: Media Server ...................... SKIPPED
[INFO] blueMarine II :: Media Server :: REST .............. SKIPPED
[INFO] blueMarine II :: Media Server :: UPnP .............. SKIPPED
[INFO] blueMarine II :: Initializer ....................... SKIPPED
[INFO] blueMarine II :: Services (modules) ................ SKIPPED
[INFO] blueMarine II :: Services :: StoppingDown .......... SKIPPED
[INFO] blueMarine II :: Headless Service .................. SKIPPED
[INFO] blueMarine II :: Application :: JavaFX ............. SKIPPED
[INFO] blueMarine II :: Plugins (modules) ................. SKIPPED
[INFO] ------------------------------------------------------------------------
[INFO] BUILD FAILURE
[INFO] ------------------------------------------------------------------------
[INFO] Total time:  27.178 s
[INFO] Finished at: 2022-08-08T04:19:56Z
[INFO] ------------------------------------------------------------------------
[ERROR] Failed to execute goal org.apache.maven.plugins:maven-site-plugin:3.9.1:site (default-site) on project bluemarine2: Execution default-site of goal org.apache.maven.plugins:maven-site-plugin:3.9.1:site failed: org.apache.maven.reporting.MavenReportException: /var/jenkins_home/jobs/blueMarine2_Metrics_OpenJDK_17/workspace/target/pmd.xml -> /var/jenkins_home/jobs/blueMarine2_Metrics_OpenJDK_17/workspace/target/site/pmd.xml: No space left on device -> [Help 1]
[ERROR] 
[ERROR] To see the full stack trace of the errors, re-run Maven with the -e switch.
[ERROR] Re-run Maven using the -X switch to enable full debug logging.
[ERROR] 
[ERROR] For more information about the errors and possible solutions, please read the following articles:
[ERROR] [Help 1] http://cwiki.apache.org/confluence/display/MAVEN/PluginExecutionException
Build step 'Invoke top-level Maven targets' marked build as failure
FATAL: com.thoughtworks.xstream.io.StreamException:  : No space left on device
java.io.IOException: No space left on device
	at sun.nio.ch.FileDispatcherImpl.write0(Native Method)
	at sun.nio.ch.FileDispatcherImpl.write(FileDispatcherImpl.java:60)
	at sun.nio.ch.IOUtil.writeFromNativeBuffer(IOUtil.java:93)
	at sun.nio.ch.IOUtil.write(IOUtil.java:65)
	at sun.nio.ch.FileChannelImpl.write(FileChannelImpl.java:211)
	at hudson.util.FileChannelWriter.write(FileChannelWriter.java:73)
	at hudson.util.AtomicFileWriter.write(AtomicFileWriter.java:166)
	at com.thoughtworks.xstream.core.util.QuickWriter.flush(QuickWriter.java:73)
Caused: com.thoughtworks.xstream.io.StreamException:  : No space left on device
	at com.thoughtworks.xstream.core.util.QuickWriter.flush(QuickWriter.java:77)
	at com.thoughtworks.xstream.io.xml.PrettyPrintWriter.flush(PrettyPrintWriter.java:346)
	at com.thoughtworks.xstream.XStream.toXML(XStream.java:990)
	at hudson.XmlFile.write(XmlFile.java:195)
Caused: java.io.IOException
	at hudson.XmlFile.write(XmlFile.java:202)
	at hudson.model.Run.save(Run.java:2077)
	at hudson.maven.MavenModuleSetBuild$MavenModuleSetBuildExecution.post2(MavenModuleSetBuild.java:1069)
	at hudson.model.AbstractBuild$AbstractBuildExecution.post(AbstractBuild.java:698)
	at hudson.model.Run.execute(Run.java:1932)
	at hudson.maven.MavenModuleSetBuild.run(MavenModuleSetBuild.java:543)
	at hudson.model.ResourceController.execute(ResourceController.java:97)
	at hudson.model.Executor.run(Executor.java:429)
Started calculate disk usage of build
Finished Calculation of disk usage of build in 0 seconds
Started calculate disk usage of workspace
Finished Calculation of disk usage of workspace in 0 seconds
Finished: FAILURE