FailedConsole Output

Skipping 16,201 KB.. Full Log
06:15:23.969 [main                ] INFO  it.tidalwave.util.test.FileComparisonUtils         - ******** Comparing files:
06:15:23.969 [main                ] INFO  it.tidalwave.util.test.FileComparisonUtils         - >>>> path is: /var/jenkins_home/jobs/blueMarine2_Metrics_OpenJDK_17/workspace/modules/Model/target/
06:15:23.970 [main                ] INFO  it.tidalwave.util.test.FileComparisonUtils         - >>>> exp is:  test-classes/expected-results/metadata/iTunes-aac-fg-20170131-1/Music/Vangelis/Soil Festivities/03 Movement 3.mp3-dump.txt
06:15:23.970 [main                ] INFO  it.tidalwave.util.test.FileComparisonUtils         - >>>> act is:  test-results/iTunes-aac-fg-20170131-1/Music/Vangelis/Soil Festivities/03 Movement 3.mp3-dump.txt
06:15:23.976 [main                ] INFO  i.t.b.model.impl.AudioMetadataFactoryTest          - TEST PASSED in 59 msec
06:15:23.976 [main                ] INFO  i.t.b.model.impl.AudioMetadataFactoryTest          - 
06:15:23.977 [main                ] INFO  i.t.b.model.impl.AudioMetadataFactoryTest          - ******************************************************************************************************************************************
06:15:23.977 [main                ] INFO  i.t.b.model.impl.AudioMetadataFactoryTest          - TEST "must properly read metadata"
06:15:23.977 [main                ] INFO  i.t.b.model.impl.AudioMetadataFactoryTest          - ARGS [iTunes-aac-fg-20170131-1: /var/test-sets/MusicTestSets/iTunes-aac-fg-20170131-1 : Music/Vangelis/Soil Festivities/04 Movement 4.mp3]
06:15:23.977 [main                ] INFO  i.t.b.model.impl.AudioMetadataFactoryTest          - ******************************************************************************************************************************************
06:15:23.979 [main                ] DEBUG i.t.bluemarine2.model.impl.AudioMetadataFactory    - path: /var/test-sets/MusicTestSets/iTunes-aac-fg-20170131-1/Music/Vangelis/Soil Festivities/04 Movement 4.mp3
Aug 15, 2022 6:15:24 AM org.jaudiotagger.audio.mp3.MP3File readV2Tag
SEVERE: Could not invoke DirectBuffer method - illegal access
06:15:24.011 [main                ] TRACE i.t.bluemarine2.model.impl.AudioMetadataFactory    - >>>> loaded keys for /var/test-sets/MusicTestSets/iTunes-aac-fg-20170131-1/Music/Vangelis/Soil Festivities/04 Movement 4.mp3: [Key(name=mp3.album, type=class java.lang.String), Key(name=mp3.title, type=class java.lang.String), Key(name=mp3.sampleRate, type=class java.lang.Integer), Key(name=tag.GENRE, type=interface java.util.List), Key(name=mp3.bitRate, type=class java.lang.Integer), Key(name=tag.TRACK_TOTAL, type=interface java.util.List), Key(name=mp3.encodingType, type=class java.lang.String), Key(name=tag.YEAR, type=interface java.util.List), Key(name=mp3.diskCount, type=class java.lang.Integer), Key(name=mp3.artist, type=class java.lang.String), Key(name=tag.COVER_ART, type=interface java.util.List), Key(name=mp3.trackNumber, type=class java.lang.Integer), Key(name=mp3.artwork, type=interface java.util.List), Key(name=mp3.bitsPerSample, type=class java.lang.Integer), Key(name=mp3.format, type=class java.lang.String), Key(name=mp3.diskNumber, type=class java.lang.Integer), Key(name=mp3.composer, type=class java.lang.String), Key(name=file.size, type=class java.lang.Long), Key(name=mp3.duration, type=class java.time.Duration), Key(name=mp3.comment, type=interface java.util.List), Key(name=tag.ALBUM_ARTIST, type=interface java.util.List), Key(name=tag.ENCODER, type=interface java.util.List)]
06:15:24.012 [main                ] INFO  it.tidalwave.util.test.FileComparisonUtils         - ******** Comparing files:
06:15:24.012 [main                ] INFO  it.tidalwave.util.test.FileComparisonUtils         - >>>> path is: /var/jenkins_home/jobs/blueMarine2_Metrics_OpenJDK_17/workspace/modules/Model/target/
06:15:24.012 [main                ] INFO  it.tidalwave.util.test.FileComparisonUtils         - >>>> exp is:  test-classes/expected-results/metadata/iTunes-aac-fg-20170131-1/Music/Vangelis/Soil Festivities/04 Movement 4.mp3-dump.txt
06:15:24.012 [main                ] INFO  it.tidalwave.util.test.FileComparisonUtils         - >>>> act is:  test-results/iTunes-aac-fg-20170131-1/Music/Vangelis/Soil Festivities/04 Movement 4.mp3-dump.txt
06:15:24.028 [main                ] INFO  i.t.b.model.impl.AudioMetadataFactoryTest          - TEST PASSED in 51 msec
06:15:24.028 [main                ] INFO  i.t.b.model.impl.AudioMetadataFactoryTest          - 
06:15:24.033 [main                ] INFO  i.t.b.model.impl.AudioMetadataFactoryTest          - ******************************************************************************************************************************************
06:15:24.033 [main                ] INFO  i.t.b.model.impl.AudioMetadataFactoryTest          - TEST "must properly read metadata"
06:15:24.033 [main                ] INFO  i.t.b.model.impl.AudioMetadataFactoryTest          - ARGS [iTunes-aac-fg-20170131-1: /var/test-sets/MusicTestSets/iTunes-aac-fg-20170131-1 : Music/Vangelis/Soil Festivities/05 Movement 5.mp3]
06:15:24.033 [main                ] INFO  i.t.b.model.impl.AudioMetadataFactoryTest          - ******************************************************************************************************************************************
06:15:24.034 [main                ] DEBUG i.t.bluemarine2.model.impl.AudioMetadataFactory    - path: /var/test-sets/MusicTestSets/iTunes-aac-fg-20170131-1/Music/Vangelis/Soil Festivities/05 Movement 5.mp3
Aug 15, 2022 6:15:24 AM org.jaudiotagger.audio.mp3.MP3File readV2Tag
SEVERE: Could not invoke DirectBuffer method - illegal access
06:15:24.078 [main                ] TRACE i.t.bluemarine2.model.impl.AudioMetadataFactory    - >>>> loaded keys for /var/test-sets/MusicTestSets/iTunes-aac-fg-20170131-1/Music/Vangelis/Soil Festivities/05 Movement 5.mp3: [Key(name=mp3.album, type=class java.lang.String), Key(name=mp3.title, type=class java.lang.String), Key(name=mp3.sampleRate, type=class java.lang.Integer), Key(name=tag.GENRE, type=interface java.util.List), Key(name=mp3.bitRate, type=class java.lang.Integer), Key(name=tag.TRACK_TOTAL, type=interface java.util.List), Key(name=mp3.encodingType, type=class java.lang.String), Key(name=tag.YEAR, type=interface java.util.List), Key(name=mp3.diskCount, type=class java.lang.Integer), Key(name=mp3.artist, type=class java.lang.String), Key(name=tag.COVER_ART, type=interface java.util.List), Key(name=mp3.trackNumber, type=class java.lang.Integer), Key(name=mp3.artwork, type=interface java.util.List), Key(name=mp3.bitsPerSample, type=class java.lang.Integer), Key(name=mp3.format, type=class java.lang.String), Key(name=mp3.diskNumber, type=class java.lang.Integer), Key(name=mp3.composer, type=class java.lang.String), Key(name=file.size, type=class java.lang.Long), Key(name=mp3.duration, type=class java.time.Duration), Key(name=mp3.comment, type=interface java.util.List), Key(name=tag.ALBUM_ARTIST, type=interface java.util.List), Key(name=tag.ENCODER, type=interface java.util.List)]
06:15:24.079 [main                ] INFO  it.tidalwave.util.test.FileComparisonUtils         - ******** Comparing files:
06:15:24.079 [main                ] INFO  it.tidalwave.util.test.FileComparisonUtils         - >>>> path is: /var/jenkins_home/jobs/blueMarine2_Metrics_OpenJDK_17/workspace/modules/Model/target/
06:15:24.079 [main                ] INFO  it.tidalwave.util.test.FileComparisonUtils         - >>>> exp is:  test-classes/expected-results/metadata/iTunes-aac-fg-20170131-1/Music/Vangelis/Soil Festivities/05 Movement 5.mp3-dump.txt
06:15:24.079 [main                ] INFO  it.tidalwave.util.test.FileComparisonUtils         - >>>> act is:  test-results/iTunes-aac-fg-20170131-1/Music/Vangelis/Soil Festivities/05 Movement 5.mp3-dump.txt
06:15:24.089 [main                ] INFO  i.t.b.model.impl.AudioMetadataFactoryTest          - TEST PASSED in 56 msec
06:15:24.089 [main                ] INFO  i.t.b.model.impl.AudioMetadataFactoryTest          - 
06:15:24.096 [main                ] INFO  i.t.bluemarine2.model.spi.PathAwareEntityTest      - *************************************************************
06:15:24.096 [main                ] INFO  i.t.bluemarine2.model.spi.PathAwareEntityTest      - TEST "relativePath in entity with parent must be relativised"
06:15:24.096 [main                ] INFO  i.t.bluemarine2.model.spi.PathAwareEntityTest      - *************************************************************
06:15:27.156 [main                ] INFO  i.t.bluemarine2.model.spi.PathAwareEntityTest      - TEST PASSED in 3060 msec
06:15:27.156 [main                ] INFO  i.t.bluemarine2.model.spi.PathAwareEntityTest      - 
06:15:27.157 [main                ] INFO  i.t.bluemarine2.model.spi.PathAwareEntityTest      - *****************************************************************
06:15:27.157 [main                ] INFO  i.t.bluemarine2.model.spi.PathAwareEntityTest      - TEST "relativePath in parentless entity must be the same as Path"
06:15:27.157 [main                ] INFO  i.t.bluemarine2.model.spi.PathAwareEntityTest      - *****************************************************************
06:15:27.175 [main                ] INFO  i.t.bluemarine2.model.spi.PathAwareEntityTest      - TEST PASSED in 18 msec
06:15:27.175 [main                ] INFO  i.t.bluemarine2.model.spi.PathAwareEntityTest      - 
06:15:27.638 [main                ] INFO  i.t.bluemarine2.model.VirtualMediaFolderTest       - FINISHED TESTS OF it.tidalwave.bluemarine2.model.VirtualMediaFolderTest
[INFO] Tests run: 4121, Failures: 0, Errors: 0, Skipped: 0, Time elapsed: 102.126 s - in TestSuite
[INFO] 
[INFO] Results:
[INFO] 
[INFO] Tests run: 4121, Failures: 0, Errors: 0, Skipped: 0
[INFO] 
[JENKINS] Recording test results
[INFO] 
[INFO] --- jacoco-maven-plugin:0.8.7:report (report) @ it-tidalwave-bluemarine2-model ---
[INFO] Loading execution data file /var/jenkins_home/jobs/blueMarine2_Metrics_OpenJDK_17/workspace/modules/Model/target/jacoco.exec
[INFO] Analyzed bundle 'blueMarine II :: Model' with 47 classes
[INFO] 
[INFO] --- maven-jar-plugin:3.2.0:jar (default-jar) @ it-tidalwave-bluemarine2-model ---
[INFO] Building jar: /var/jenkins_home/jobs/blueMarine2_Metrics_OpenJDK_17/workspace/modules/Model/target/it-tidalwave-bluemarine2-model-1.1-ALPHA-2-SNAPSHOT.5bd725d04573.jar
[INFO] 
[INFO] --- maven-jar-plugin:3.2.0:test-jar (default-test-jar) @ it-tidalwave-bluemarine2-model ---
[INFO] Building jar: /var/jenkins_home/jobs/blueMarine2_Metrics_OpenJDK_17/workspace/modules/Model/target/it-tidalwave-bluemarine2-model-1.1-ALPHA-2-SNAPSHOT.5bd725d04573-tests.jar
[INFO] 
[INFO] --- maven-install-plugin:3.0.0-M1:install (default-install) @ it-tidalwave-bluemarine2-model ---
[INFO] Installing /var/jenkins_home/jobs/blueMarine2_Metrics_OpenJDK_17/workspace/modules/Model/target/it-tidalwave-bluemarine2-model-1.1-ALPHA-2-SNAPSHOT.5bd725d04573.jar to /var/jenkins_home/jobs/blueMarine2_Metrics_OpenJDK_17/workspace@tmp/repository/it/tidalwave/bluemarine2/it-tidalwave-bluemarine2-model/1.1-ALPHA-2-SNAPSHOT/it-tidalwave-bluemarine2-model-1.1-ALPHA-2-SNAPSHOT.jar
[INFO] Installing /var/jenkins_home/jobs/blueMarine2_Metrics_OpenJDK_17/workspace/modules/Model/pom.xml to /var/jenkins_home/jobs/blueMarine2_Metrics_OpenJDK_17/workspace@tmp/repository/it/tidalwave/bluemarine2/it-tidalwave-bluemarine2-model/1.1-ALPHA-2-SNAPSHOT/it-tidalwave-bluemarine2-model-1.1-ALPHA-2-SNAPSHOT.pom
[INFO] Installing /var/jenkins_home/jobs/blueMarine2_Metrics_OpenJDK_17/workspace/modules/Model/target/it-tidalwave-bluemarine2-model-1.1-ALPHA-2-SNAPSHOT.5bd725d04573-tests.jar to /var/jenkins_home/jobs/blueMarine2_Metrics_OpenJDK_17/workspace@tmp/repository/it/tidalwave/bluemarine2/it-tidalwave-bluemarine2-model/1.1-ALPHA-2-SNAPSHOT/it-tidalwave-bluemarine2-model-1.1-ALPHA-2-SNAPSHOT-tests.jar
[INFO] 
[INFO] >>> maven-dependency-plugin:3.1.2:analyze (default-cli) > test-compile @ it-tidalwave-bluemarine2-model >>>
[INFO] 
[INFO] --- buildnumber-maven-plugin:1.4:create (default) @ it-tidalwave-bluemarine2-model ---
[INFO] ShortRevision tag detected. The value is '12'.
[INFO] Executing: /bin/sh -c cd '/var/jenkins_home/jobs/blueMarine2_Metrics_OpenJDK_17/workspace/modules/Model' && 'git' 'rev-parse' '--verify' '--short=12' 'HEAD'
[INFO] Working directory: /var/jenkins_home/jobs/blueMarine2_Metrics_OpenJDK_17/workspace/modules/Model
[INFO] Storing buildNumber: 5bd725d04573 at timestamp: 1660536957036
[WARNING] Cannot get the branch information from the git repository: 
Detecting the current branch failed: fatal: ref HEAD is not a symbolic ref

[INFO] ShortRevision tag detected. The value is '12'.
[INFO] Executing: /bin/sh -c cd '/var/jenkins_home/jobs/blueMarine2_Metrics_OpenJDK_17/workspace/modules/Model' && 'git' 'rev-parse' '--verify' '--short=12' 'HEAD'
[INFO] Working directory: /var/jenkins_home/jobs/blueMarine2_Metrics_OpenJDK_17/workspace/modules/Model
[INFO] Storing buildScmBranch: UNKNOWN
[INFO] 
[INFO] --- maven-enforcer-plugin:3.0.0-M3:enforce (enforce-maven) @ it-tidalwave-bluemarine2-model ---
[INFO] 
[INFO] --- maven-enforcer-plugin:3.0.0-M3:enforce (enforce-banned-dependencies) @ it-tidalwave-bluemarine2-model ---
[INFO] 
[INFO] --- maven-antrun-plugin:3.0.0:run (generate-and-print-build-description) @ it-tidalwave-bluemarine2-model ---
[INFO] Executing tasks
[INFO]      [echo] DESCRIPTION: origin/master 1.1-ALPHA-2-SNAPSHOT 5bd725d04573
[INFO]      [echo] Java Version: 17.0.1 -source 11 -target 11 -release 11
[INFO] Executed tasks
[INFO] 
[INFO] --- jacoco-maven-plugin:0.8.7:prepare-agent (prepare-agent) @ it-tidalwave-bluemarine2-model ---
[INFO] tft.test.jacoco.argLine set to -javaagent:/var/jenkins_home/jobs/blueMarine2_Metrics_OpenJDK_17/workspace@tmp/repository/org/jacoco/org.jacoco.agent/0.8.7/org.jacoco.agent-0.8.7-runtime.jar=destfile=/var/jenkins_home/jobs/blueMarine2_Metrics_OpenJDK_17/workspace/modules/Model/target/jacoco.exec
[INFO] 
[INFO] --- maven-antrun-plugin:3.0.0:run (create-unwoven-classes-dirs) @ it-tidalwave-bluemarine2-model ---
[INFO] Executing tasks
[INFO] Executed tasks
[INFO] 
[INFO] --- maven-resources-plugin:3.2.0:resources (default-resources) @ it-tidalwave-bluemarine2-model ---
[INFO] Using 'UTF-8' encoding to copy filtered resources.
[INFO] Using 'UTF-8' encoding to copy filtered properties files.
[INFO] Copying 1 resource
[INFO] 
[INFO] --- maven-compiler-plugin:3.8.1:compile (default-compile) @ it-tidalwave-bluemarine2-model ---
[INFO] Changes detected - recompiling the module!
[INFO] Compiling 45 source files to /var/jenkins_home/jobs/blueMarine2_Metrics_OpenJDK_17/workspace/modules/Model/target/unwoven-classes
[WARNING] No processor claimed any of these annotations: /org.springframework.core.annotation.Order,/javax.annotation.Nullable,/it.tidalwave.messagebus.annotation.ListensTo,/javax.annotation.Nonnegative,/it.tidalwave.dci.annotation.DciRole,/javax.annotation.Nonnull,/it.tidalwave.util.annotation.VisibleForTesting,/it.tidalwave.messagebus.annotation.SimpleMessageSubscriber,/javax.annotation.concurrent.Immutable
[WARNING] /var/jenkins_home/jobs/blueMarine2_Metrics_OpenJDK_17/workspace/modules/Model/src/main/java/it/tidalwave/bluemarine2/model/MediaItem.java:[85,56] [deprecation] <T>Key(String) in Key has been deprecated
  where T is a type-variable:
    T extends Object declared in class Key
[WARNING] /var/jenkins_home/jobs/blueMarine2_Metrics_OpenJDK_17/workspace/modules/Model/src/main/java/it/tidalwave/bluemarine2/model/MediaItem.java:[85,81] [deprecation] Key(String) in Key has been deprecated
[WARNING] /var/jenkins_home/jobs/blueMarine2_Metrics_OpenJDK_17/workspace/modules/Model/src/main/java/it/tidalwave/bluemarine2/model/MediaItem.java:[91,56] [deprecation] <T>Key(String) in Key has been deprecated
  where T is a type-variable:
    T extends Object declared in class Key
[WARNING] /var/jenkins_home/jobs/blueMarine2_Metrics_OpenJDK_17/workspace/modules/Model/src/main/java/it/tidalwave/bluemarine2/model/MediaItem.java:[91,81] [deprecation] Key(String) in Key has been deprecated
[WARNING] /var/jenkins_home/jobs/blueMarine2_Metrics_OpenJDK_17/workspace/modules/Model/src/main/java/it/tidalwave/bluemarine2/model/MediaItem.java:[96,58] [deprecation] <T>Key(String) in Key has been deprecated
  where T is a type-variable:
    T extends Object declared in class Key
[WARNING] /var/jenkins_home/jobs/blueMarine2_Metrics_OpenJDK_17/workspace/modules/Model/src/main/java/it/tidalwave/bluemarine2/model/MediaItem.java:[96,84] [deprecation] Key(String) in Key has been deprecated
[WARNING] /var/jenkins_home/jobs/blueMarine2_Metrics_OpenJDK_17/workspace/modules/Model/src/main/java/it/tidalwave/bluemarine2/model/MediaItem.java:[98,49] [deprecation] <T>Key(String) in Key has been deprecated
  where T is a type-variable:
    T extends Object declared in class Key
[WARNING] /var/jenkins_home/jobs/blueMarine2_Metrics_OpenJDK_17/workspace/modules/Model/src/main/java/it/tidalwave/bluemarine2/model/MediaItem.java:[98,74] [deprecation] Key(String) in Key has been deprecated
[WARNING] /var/jenkins_home/jobs/blueMarine2_Metrics_OpenJDK_17/workspace/modules/Model/src/main/java/it/tidalwave/bluemarine2/model/VirtualMediaFolder.java:[124,42] [unchecked] unchecked cast
  required: Optional<PathAwareEntity>
  found:    Object
[WARNING] /var/jenkins_home/jobs/blueMarine2_Metrics_OpenJDK_17/workspace/modules/Model/src/main/java/it/tidalwave/bluemarine2/model/impl/DefaultMediaFileSystem.java:[81,47] [deprecation] <T>get(Key<T>) in TypeSafeMap has been deprecated
  where T is a type-variable:
    T extends Object declared in method <T>get(Key<T>)
[WARNING] /var/jenkins_home/jobs/blueMarine2_Metrics_OpenJDK_17/workspace/modules/Model/src/main/java/it/tidalwave/bluemarine2/model/impl/AudioMetadataFactory.java:[129,74] [unchecked] unchecked cast
  required: Key<Object>
  found:    Key<CAP#1>
  where CAP#1 is a fresh type-variable:
    CAP#1 extends Object from capture of ?
[WARNING] /var/jenkins_home/jobs/blueMarine2_Metrics_OpenJDK_17/workspace/modules/Model/src/main/java/it/tidalwave/bluemarine2/model/impl/PathAwareMediaFolderDecorator.java:[81,61] [unchecked] unchecked conversion
  required: SimpleComposite<Entity>
  found:    SimpleComposite
[WARNING] /var/jenkins_home/jobs/blueMarine2_Metrics_OpenJDK_17/workspace/modules/Model/src/main/java/it/tidalwave/bluemarine2/model/impl/PathAwareMediaFolderDecorator.java:[115,29] [unchecked] unchecked method invocation: constructor <init> in class MappingFinder is applied to given types
  required: Finder<TYPE>,Function<TYPE,TYPE>
  found:    Finder,Function<Object,Object>
  where TYPE is a type-variable:
    TYPE extends Object declared in class MappingFinder
[WARNING] /var/jenkins_home/jobs/blueMarine2_Metrics_OpenJDK_17/workspace/modules/Model/src/main/java/it/tidalwave/bluemarine2/model/impl/PathAwareMediaFolderDecorator.java:[115,49] [unchecked] unchecked conversion
  required: Finder<TYPE>
  found:    Finder
  where TYPE is a type-variable:
    TYPE extends Object declared in class MappingFinder
[WARNING] /var/jenkins_home/jobs/blueMarine2_Metrics_OpenJDK_17/workspace/modules/Model/src/main/java/it/tidalwave/bluemarine2/model/impl/PathAwareMediaFolderDecorator.java:[114,15] [unchecked] unchecked method invocation: constructor <init> in class PathAwareEntityFinderDelegate is applied to given types
  required: MediaFolder,Finder<PathAwareEntity>
  found:    MediaFolder,MappingFinder
[WARNING] /var/jenkins_home/jobs/blueMarine2_Metrics_OpenJDK_17/workspace/modules/Model/src/main/java/it/tidalwave/bluemarine2/model/impl/PathAwareMediaFolderDecorator.java:[115,29] [unchecked] unchecked conversion
  required: Finder<PathAwareEntity>
  found:    MappingFinder
[WARNING] /var/jenkins_home/jobs/blueMarine2_Metrics_OpenJDK_17/workspace/modules/Model/src/main/java/it/tidalwave/bluemarine2/model/impl/DefaultCacheManager.java:[63,53] [unchecked] unchecked cast
  required: SoftReference<T>
  found:    SoftReference<CAP#1>
  where T is a type-variable:
    T extends Object declared in method <T>getCachedObject(Object,Supplier<T>)
  where CAP#1 is a fresh type-variable:
    CAP#1 extends Object from capture of ?
[WARNING] /var/jenkins_home/jobs/blueMarine2_Metrics_OpenJDK_17/workspace/modules/Model/src/main/java/it/tidalwave/bluemarine2/model/impl/PathAwareEntityFinderDelegate.java:[152,61] [unchecked] unchecked method invocation: method orElse in class Optional is applied to given types
  required: T
  found:    List
  where T is a type-variable:
    T extends Object declared in class Optional
[WARNING] /var/jenkins_home/jobs/blueMarine2_Metrics_OpenJDK_17/workspace/modules/Model/src/main/java/it/tidalwave/bluemarine2/model/impl/PathAwareEntityFinderDelegate.java:[152,62] [unchecked] unchecked conversion
  required: T
  found:    List
  where T is a type-variable:
    T extends Object declared in class Optional
[WARNING] /var/jenkins_home/jobs/blueMarine2_Metrics_OpenJDK_17/workspace/modules/Model/src/main/java/it/tidalwave/bluemarine2/model/impl/PathAwareEntityFinderDelegate.java:[151,15] [unchecked] unchecked method invocation: constructor <init> in class CopyOnWriteArrayList is applied to given types
  required: Collection<? extends E>
  found:    List
  where E is a type-variable:
    E extends Object declared in class CopyOnWriteArrayList
[WARNING] /var/jenkins_home/jobs/blueMarine2_Metrics_OpenJDK_17/workspace/modules/Model/src/main/java/it/tidalwave/bluemarine2/model/impl/PathAwareEntityFinderDelegate.java:[152,61] [unchecked] unchecked conversion
  required: Collection<? extends E>
  found:    List
  where E is a type-variable:
    E extends Object declared in class CopyOnWriteArrayList
[WARNING] /var/jenkins_home/jobs/blueMarine2_Metrics_OpenJDK_17/workspace/modules/Model/src/main/java/it/tidalwave/bluemarine2/model/impl/PathAwareEntityFinderDelegate.java:[151,15] [unchecked] unchecked conversion
  required: List<? extends PathAwareEntity>
  found:    CopyOnWriteArrayList
[WARNING] /var/jenkins_home/jobs/blueMarine2_Metrics_OpenJDK_17/workspace/modules/Model/src/main/java/it/tidalwave/bluemarine2/model/impl/PathAwareEntityFinderDelegate.java:[207,60] [unchecked] unchecked cast
  required: Optional<PathAwareEntity>
  found:    Optional<CAP#1>
  where CAP#1 is a fresh type-variable:
    CAP#1 extends PathAwareEntity from capture of ? extends PathAwareEntity
[WARNING] /var/jenkins_home/jobs/blueMarine2_Metrics_OpenJDK_17/workspace/modules/Model/src/main/java/it/tidalwave/bluemarine2/model/impl/PathAwareEntityFinderDelegate.java:[230,19] [rawtypes] found raw type: SimpleComposite
  missing type arguments for generic class SimpleComposite<TYPE>
  where TYPE is a type-variable:
    TYPE extends Object declared in interface SimpleComposite
[WARNING] /var/jenkins_home/jobs/blueMarine2_Metrics_OpenJDK_17/workspace/modules/Model/src/main/java/it/tidalwave/bluemarine2/model/spi/MetadataSupport.java:[79,82] [unchecked] unchecked cast
  required: T
  found:    Object
  where T is a type-variable:
    T extends Object declared in method <T>get(Key<T>)
[WARNING] /var/jenkins_home/jobs/blueMarine2_Metrics_OpenJDK_17/workspace/modules/Model/src/main/java/it/tidalwave/bluemarine2/model/spi/MetadataSupport.java:[91,40] [unchecked] unchecked cast
  required: T
  found:    Object
  where T is a type-variable:
    T extends Object declared in method <T>getAll(Key<T>)
[WARNING] /var/jenkins_home/jobs/blueMarine2_Metrics_OpenJDK_17/workspace/modules/Model/src/main/java/it/tidalwave/bluemarine2/model/spi/MetadataSupport.java:[93,94] [unchecked] unchecked cast
  required: T
  found:    List<Object>
  where T is a type-variable:
    T extends Object declared in method <T>getAll(Key<T>)
[INFO] 
[INFO] --- aspectj-maven-plugin:1.11:compile (weave-classes) @ it-tidalwave-bluemarine2-model ---
[INFO] Showing AJC message detail for messages of types: [error, warning, fail]
[INFO] 
[INFO] --- maven-dependency-plugin:3.1.2:unpack (default) @ it-tidalwave-bluemarine2-model ---
[INFO] Configured Artifact: it.tidalwave.bluemarine2.testsets:expected-metadata-iTunes-fg-20160504-2:5:zip
[INFO] Configured Artifact: it.tidalwave.bluemarine2.testsets:expected-metadata-iTunes-fg-20161210-1:2:zip
[INFO] Configured Artifact: it.tidalwave.bluemarine2.testsets:expected-metadata-iTunes-aac-fg-20170131-1:3:zip
[INFO] Configured Artifact: it.tidalwave.bluemarine2.testsets:expected-metadata-amazon-autorip-fg-20170131-1:3:zip
[INFO] Unpacking /var/jenkins_home/jobs/blueMarine2_Metrics_OpenJDK_17/workspace@tmp/repository/it/tidalwave/bluemarine2/testsets/expected-metadata-iTunes-fg-20160504-2/5/expected-metadata-iTunes-fg-20160504-2-5.zip to /var/jenkins_home/jobs/blueMarine2_Metrics_OpenJDK_17/workspace/modules/Model/target/test-classes/expected-results/metadata with includes "" and excludes ""
[INFO] Unpacking /var/jenkins_home/jobs/blueMarine2_Metrics_OpenJDK_17/workspace@tmp/repository/it/tidalwave/bluemarine2/testsets/expected-metadata-iTunes-fg-20161210-1/2/expected-metadata-iTunes-fg-20161210-1-2.zip to /var/jenkins_home/jobs/blueMarine2_Metrics_OpenJDK_17/workspace/modules/Model/target/test-classes/expected-results/metadata with includes "" and excludes ""
[INFO] Unpacking /var/jenkins_home/jobs/blueMarine2_Metrics_OpenJDK_17/workspace@tmp/repository/it/tidalwave/bluemarine2/testsets/expected-metadata-iTunes-aac-fg-20170131-1/3/expected-metadata-iTunes-aac-fg-20170131-1-3.zip to /var/jenkins_home/jobs/blueMarine2_Metrics_OpenJDK_17/workspace/modules/Model/target/test-classes/expected-results/metadata with includes "" and excludes ""
[INFO] Unpacking /var/jenkins_home/jobs/blueMarine2_Metrics_OpenJDK_17/workspace@tmp/repository/it/tidalwave/bluemarine2/testsets/expected-metadata-amazon-autorip-fg-20170131-1/3/expected-metadata-amazon-autorip-fg-20170131-1-3.zip to /var/jenkins_home/jobs/blueMarine2_Metrics_OpenJDK_17/workspace/modules/Model/target/test-classes/expected-results/metadata with includes "" and excludes ""
[INFO] 
[INFO] --- maven-resources-plugin:3.2.0:testResources (default-testResources) @ it-tidalwave-bluemarine2-model ---
[INFO] Using 'UTF-8' encoding to copy filtered resources.
[INFO] Using 'UTF-8' encoding to copy filtered properties files.
[INFO] Copying 1 resource
[INFO] 
[INFO] --- maven-compiler-plugin:3.8.1:testCompile (default-testCompile) @ it-tidalwave-bluemarine2-model ---
[INFO] Changes detected - recompiling the module!
[INFO] Compiling 4 source files to /var/jenkins_home/jobs/blueMarine2_Metrics_OpenJDK_17/workspace/modules/Model/target/unwoven-test-classes
[WARNING] No processor claimed any of these annotations: /javax.annotation.Nonnull,/org.testng.annotations.BeforeMethod,/org.testng.annotations.Test,/org.testng.annotations.DataProvider
[WARNING] Failed to getClass for org.apache.maven.plugins.dependency.analyze.AnalyzeMojo
[INFO] 
[INFO] <<< maven-dependency-plugin:3.1.2:analyze (default-cli) < test-compile @ it-tidalwave-bluemarine2-model <<<
[INFO] 
[INFO] 
[INFO] --- maven-dependency-plugin:3.1.2:analyze (default-cli) @ it-tidalwave-bluemarine2-model ---
[WARNING] Used undeclared dependencies found:
[WARNING]    com.google.code.findbugs:jsr305:jar:3.0.2:compile
[WARNING]    org.springframework:spring-core:jar:5.3.1:compile
[WARNING]    com.github.spotbugs:spotbugs-annotations:jar:3.1.9:compile
[WARNING]    org.hamcrest:hamcrest-core:jar:1.3:test
[WARNING]    org.openjfx:javafx-base:jar:linux:11.0.1:provided
[WARNING] Unused declared dependencies found:
[WARNING]    org.springframework:spring-aspects:jar:5.3.1:compile
[WARNING]    org.openjfx:javafx-base:jar:11.0.1:provided
[WARNING]    javax.inject:javax.inject:jar:1:compile
[WARNING]    org.projectlombok:lombok:jar:1.18.22:provided
[WARNING]    org.slf4j:jcl-over-slf4j:jar:1.7.30:runtime
[WARNING]    org.slf4j:jul-to-slf4j:jar:1.7.30:runtime
[WARNING]    ch.qos.logback:logback-classic:jar:1.2.3:runtime
[WARNING]    it.tidalwave.thesefoolishthings:it-tidalwave-util-test:jar:3.2-ALPHA-11:test
[WARNING]    org.hamcrest:hamcrest-all:jar:1.3:test
[WARNING]    org.aspectj:aspectjrt:jar:1.9.6:compile
[JENKINS] Archiving disabled
Started calculate disk usage of build
Finished Calculation of disk usage of build in 0 seconds
Started calculate disk usage of workspace
Finished Calculation of disk usage of workspace in 0 seconds
[INFO] 
[INFO] ---< it.tidalwave.bluemarine2:it-tidalwave-bluemarine2-persistence >----
[INFO] Building blueMarine II :: Persistence 1.1-ALPHA-2-SNAPSHOT        [7/26]
[INFO] --------------------------------[ jar ]---------------------------------
[INFO] 
[INFO] --- maven-clean-plugin:3.1.0:clean (default-clean) @ it-tidalwave-bluemarine2-persistence ---
[INFO] 
[INFO] --- buildnumber-maven-plugin:1.4:create (default) @ it-tidalwave-bluemarine2-persistence ---
[INFO] ShortRevision tag detected. The value is '12'.
[INFO] Executing: /bin/sh -c cd '/var/jenkins_home/jobs/blueMarine2_Metrics_OpenJDK_17/workspace/modules/Persistence' && 'git' 'rev-parse' '--verify' '--short=12' 'HEAD'
[INFO] Working directory: /var/jenkins_home/jobs/blueMarine2_Metrics_OpenJDK_17/workspace/modules/Persistence
[INFO] Storing buildNumber: 5bd725d04573 at timestamp: 1660536986390
[WARNING] Cannot get the branch information from the git repository: 
Detecting the current branch failed: fatal: ref HEAD is not a symbolic ref

[INFO] ShortRevision tag detected. The value is '12'.
[INFO] Executing: /bin/sh -c cd '/var/jenkins_home/jobs/blueMarine2_Metrics_OpenJDK_17/workspace/modules/Persistence' && 'git' 'rev-parse' '--verify' '--short=12' 'HEAD'
[INFO] Working directory: /var/jenkins_home/jobs/blueMarine2_Metrics_OpenJDK_17/workspace/modules/Persistence
[INFO] Storing buildScmBranch: UNKNOWN
[INFO] 
[INFO] --- maven-enforcer-plugin:3.0.0-M3:enforce (enforce-maven) @ it-tidalwave-bluemarine2-persistence ---
[INFO] 
[INFO] --- maven-enforcer-plugin:3.0.0-M3:enforce (enforce-banned-dependencies) @ it-tidalwave-bluemarine2-persistence ---
[INFO] 
[INFO] --- maven-antrun-plugin:3.0.0:run (generate-and-print-build-description) @ it-tidalwave-bluemarine2-persistence ---
[INFO] Executing tasks
[INFO]      [echo] DESCRIPTION: origin/master 1.1-ALPHA-2-SNAPSHOT 5bd725d04573
[INFO]      [echo] Java Version: 17.0.1 -source 11 -target 11 -release 11
[INFO] Executed tasks
[INFO] 
[INFO] --- jacoco-maven-plugin:0.8.7:prepare-agent (prepare-agent) @ it-tidalwave-bluemarine2-persistence ---
[INFO] tft.test.jacoco.argLine set to -javaagent:/var/jenkins_home/jobs/blueMarine2_Metrics_OpenJDK_17/workspace@tmp/repository/org/jacoco/org.jacoco.agent/0.8.7/org.jacoco.agent-0.8.7-runtime.jar=destfile=/var/jenkins_home/jobs/blueMarine2_Metrics_OpenJDK_17/workspace/modules/Persistence/target/jacoco.exec
[INFO] 
[INFO] --- maven-antrun-plugin:3.0.0:run (create-unwoven-classes-dirs) @ it-tidalwave-bluemarine2-persistence ---
[INFO] Executing tasks
[INFO]     [mkdir] Created dir: /var/jenkins_home/jobs/blueMarine2_Metrics_OpenJDK_17/workspace/modules/Persistence/target/unwoven-classes
[INFO]     [mkdir] Created dir: /var/jenkins_home/jobs/blueMarine2_Metrics_OpenJDK_17/workspace/modules/Persistence/target/unwoven-test-classes
[INFO] Executed tasks
[INFO] 
[INFO] --- maven-resources-plugin:3.2.0:resources (default-resources) @ it-tidalwave-bluemarine2-persistence ---
[INFO] Using 'UTF-8' encoding to copy filtered resources.
[INFO] Using 'UTF-8' encoding to copy filtered properties files.
[INFO] Copying 1 resource
[INFO] 
[INFO] --- maven-compiler-plugin:3.8.1:compile (default-compile) @ it-tidalwave-bluemarine2-persistence ---
[INFO] Changes detected - recompiling the module!
[INFO] Compiling 4 source files to /var/jenkins_home/jobs/blueMarine2_Metrics_OpenJDK_17/workspace/modules/Persistence/target/unwoven-classes
[WARNING] No processor claimed any of these annotations: /javax.annotation.Nonnull,/it.tidalwave.util.annotation.VisibleForTesting,/it.tidalwave.messagebus.annotation.ListensTo,/it.tidalwave.messagebus.annotation.SimpleMessageSubscriber,/javax.inject.Inject
[WARNING] /var/jenkins_home/jobs/blueMarine2_Metrics_OpenJDK_17/workspace/modules/Persistence/src/main/java/it/tidalwave/bluemarine2/persistence/impl/RepositoryDelegate.java:[60,16] [deprecation] initialize() in Repository has been deprecated
[WARNING] /var/jenkins_home/jobs/blueMarine2_Metrics_OpenJDK_17/workspace/modules/Persistence/src/main/java/it/tidalwave/bluemarine2/persistence/impl/DefaultPersistence.java:[128,18] [deprecation] initialize() in Repository has been deprecated
[INFO] 
[INFO] --- aspectj-maven-plugin:1.11:compile (weave-classes) @ it-tidalwave-bluemarine2-persistence ---
[INFO] Showing AJC message detail for messages of types: [error, warning, fail]
[INFO] 
[INFO] --- maven-resources-plugin:3.2.0:testResources (default-testResources) @ it-tidalwave-bluemarine2-persistence ---
[INFO] Using 'UTF-8' encoding to copy filtered resources.
[INFO] Using 'UTF-8' encoding to copy filtered properties files.
[INFO] Copying 3 resources
[INFO] 
[INFO] --- maven-compiler-plugin:3.8.1:testCompile (default-testCompile) @ it-tidalwave-bluemarine2-persistence ---
[INFO] Changes detected - recompiling the module!
[INFO] Compiling 1 source file to /var/jenkins_home/jobs/blueMarine2_Metrics_OpenJDK_17/workspace/modules/Persistence/target/unwoven-test-classes
[WARNING] No processor claimed any of these annotations: /org.testng.annotations.Test,/javax.annotation.Nonnull,/org.testng.annotations.BeforeMethod
[WARNING] /var/jenkins_home/jobs/blueMarine2_Metrics_OpenJDK_17/workspace/modules/Persistence/src/test/java/it/tidalwave/bluemarine2/persistence/impl/DefaultPersistenceTest.java:[232,18] [deprecation] initialize() in Repository has been deprecated
[INFO] 
[INFO] --- aspectj-maven-plugin:1.11:test-compile (weave-test-classes) @ it-tidalwave-bluemarine2-persistence ---
[INFO] Showing AJC message detail for messages of types: [error, warning, fail]
[INFO] 
[INFO] --- maven-surefire-plugin:3.0.0-M5:test (default-test) @ it-tidalwave-bluemarine2-persistence ---
[INFO] 
[INFO] -------------------------------------------------------
[INFO]  T E S T S
[INFO] -------------------------------------------------------
[INFO] Running it.tidalwave.bluemarine2.persistence.impl.DefaultPersistenceTest
06:16:48.248 [main                ] INFO  i.t.b.persistence.impl.DefaultPersistenceTest      - STARTING TESTS OF it.tidalwave.bluemarine2.persistence.impl.DefaultPersistenceTest
06:16:48.326 [main                ] INFO  i.t.bluemarine2.commons.test.SpringTestSupport     - Spring configuration locations: [META-INF/PersistenceTestBeans.xml]
06:16:53.627 [main                ] TRACE it.tidalwave.messagebus.MessageBusHelper           - registerMessageListener(void it.tidalwave.bluemarine2.persistence.impl.DefaultPersistence.onPowerOnNotification(it.tidalwave.bluemarine2.message.PowerOnNotification) throws org.eclipse.rdf4j.repository.RepositoryException,java.io.IOException,org.eclipse.rdf4j.rio.RDFParseException)
06:16:53.647 [main                ] TRACE it.tidalwave.messagebus.MessageBusHelper           - registerMessageListener(void it.tidalwave.bluemarine2.persistence.impl.DefaultPersistence.onPowerOffNotification(it.tidalwave.bluemarine2.message.PowerOffNotification) throws org.eclipse.rdf4j.repository.RepositoryException,java.io.IOException,org.eclipse.rdf4j.rio.RDFParseException)
06:16:53.673 [main                ] INFO  i.t.bluemarine2.commons.test.SpringTestSupport     - >>>> bean names: [org.springframework.context.annotation.internalConfigurationAnnotationProcessor, org.springframework.context.annotation.internalAutowiredAnnotationProcessor, org.springframework.context.annotation.internalCommonAnnotationProcessor, org.springframework.context.event.internalEventListenerProcessor, org.springframework.context.event.internalEventListenerFactory, org.springframework.context.config.internalBeanConfigurerAspect, org.springframework.aop.config.internalAutoProxyCreator, underTest, applicationMessageBus]
06:16:53.708 [main                ] INFO  i.t.b.persistence.impl.DefaultPersistenceTest      - *************************************************
06:16:53.708 [main                ] INFO  i.t.b.persistence.impl.DefaultPersistenceTest      - TEST "must use MemoryStore when no configuration"
06:16:53.708 [main                ] INFO  i.t.b.persistence.impl.DefaultPersistenceTest      - *************************************************
06:16:53.724 [main                ] INFO  i.t.b.persistence.impl.DefaultPersistence          - onPowerOnNotification(PowerOnNotification(properties={}))
06:16:53.749 [main                ] WARN  i.t.b.persistence.impl.DefaultPersistence          - No storage path: working in memory
06:16:53.834 [main                ] DEBUG org.eclipse.rdf4j.sail.memory.MemoryStore          - Initializing MemoryStore...
06:16:54.046 [main                ] DEBUG org.eclipse.rdf4j.sail.memory.MemoryStore          - MemoryStore initialized
06:16:54.052 [main                ] INFO  i.t.b.persistence.impl.DefaultPersistenceTest      - TEST PASSED in 345 msec
06:16:54.082 [main                ] INFO  i.t.b.persistence.impl.DefaultPersistenceTest      - 
06:16:54.130 [nvoker-afterMethod()] INFO  i.t.bluemarine2.commons.test.SpringTestSupport     - Closing Spring context...
06:16:54.149 [main                ] INFO  i.t.bluemarine2.commons.test.SpringTestSupport     - Spring configuration locations: [META-INF/PersistenceTestBeans.xml]
06:16:54.432 [main                ] TRACE it.tidalwave.messagebus.MessageBusHelper           - registerMessageListener(void it.tidalwave.bluemarine2.persistence.impl.DefaultPersistence.onPowerOnNotification(it.tidalwave.bluemarine2.message.PowerOnNotification) throws org.eclipse.rdf4j.repository.RepositoryException,java.io.IOException,org.eclipse.rdf4j.rio.RDFParseException)
06:16:54.462 [main                ] TRACE it.tidalwave.messagebus.MessageBusHelper           - registerMessageListener(void it.tidalwave.bluemarine2.persistence.impl.DefaultPersistence.onPowerOffNotification(it.tidalwave.bluemarine2.message.PowerOffNotification) throws org.eclipse.rdf4j.repository.RepositoryException,java.io.IOException,org.eclipse.rdf4j.rio.RDFParseException)
06:16:54.465 [main                ] INFO  i.t.bluemarine2.commons.test.SpringTestSupport     - >>>> bean names: [org.springframework.context.annotation.internalConfigurationAnnotationProcessor, org.springframework.context.annotation.internalAutowiredAnnotationProcessor, org.springframework.context.annotation.internalCommonAnnotationProcessor, org.springframework.context.event.internalEventListenerProcessor, org.springframework.context.event.internalEventListenerFactory, org.springframework.context.config.internalBeanConfigurerAspect, org.springframework.aop.config.internalAutoProxyCreator, underTest, applicationMessageBus]
06:16:54.532 [main                ] INFO  i.t.b.persistence.impl.DefaultPersistenceTest      - *************************************************************************************
06:16:54.533 [main                ] INFO  i.t.b.persistence.impl.DefaultPersistenceTest      - TEST "must use NativeStore and import when STORAGE FOLDER and IMPORT FILE configured"
06:16:54.554 [main                ] INFO  i.t.b.persistence.impl.DefaultPersistenceTest      - *************************************************************************************
06:16:54.555 [main                ] INFO  i.t.b.persistence.impl.DefaultPersistence          - onPowerOnNotification(PowerOnNotification(properties={Key(name=it.tidalwave.bluemarine2.persistence.storagePath, type=interface java.nio.file.Path)=target/workspace/storageFolder, Key(name=it.tidalwave.bluemarine2.persistence.importFile, type=interface java.nio.file.Path)=target/workspace/triples.n3}))
06:16:54.555 [main                ] INFO  i.t.b.persistence.impl.DefaultPersistence          - Disk storage at Optional[target/workspace/storageFolder]
06:16:54.555 [main                ] WARN  i.t.b.persistence.impl.DefaultPersistence          - Scratching store ...
06:16:54.604 [main                ] DEBUG org.eclipse.rdf4j.sail.nativerdf.NativeStore       - Initializing NativeStore...
06:16:54.674 [main                ] DEBUG org.eclipse.rdf4j.sail.nativerdf.NativeStore       - Data dir is target/workspace/storageFolder
06:16:55.106 [main                ] DEBUG org.eclipse.rdf4j.sail.nativerdf.TripleStore       - No indexes specified, using default indexes: spoc,posc
06:16:55.113 [main                ] TRACE org.eclipse.rdf4j.sail.nativerdf.TripleStore       - Initializing index 'spoc'...
06:16:55.150 [main                ] TRACE org.eclipse.rdf4j.sail.nativerdf.TripleStore       - Initializing index 'posc'...
06:16:55.200 [main                ] DEBUG org.eclipse.rdf4j.sail.nativerdf.ContextStore      - context index has not been created yet: context index file target/workspace/storageFolder/contexts.dat does not exist
06:16:55.203 [main                ] DEBUG org.eclipse.rdf4j.sail.nativerdf.ContextStore      - initializing context cache
06:16:55.230 [main                ] DEBUG org.eclipse.rdf4j.sail.nativerdf.ContextStore      - context index construction complete
06:16:55.249 [main                ] DEBUG org.eclipse.rdf4j.sail.nativerdf.NativeStore       - NativeStore initialized
06:16:55.454 [main                ] INFO  i.t.b.persistence.impl.DefaultPersistence          - Importing repository from target/workspace/triples.n3 ...
06:16:55.495 [main                ] DEBUG org.eclipse.rdf4j.rio.RDFParserRegistry            - Registered service class org.eclipse.rdf4j.rio.ntriples.NTriplesParserFactory
06:16:55.502 [main                ] DEBUG org.eclipse.rdf4j.rio.RDFParserRegistry            - Registered service class org.eclipse.rdf4j.rio.trig.TriGParserFactory
06:16:55.502 [main                ] DEBUG org.eclipse.rdf4j.rio.RDFParserRegistry            - Registered service class org.eclipse.rdf4j.rio.trigstar.TriGStarParserFactory
06:16:55.516 [main                ] DEBUG org.eclipse.rdf4j.rio.RDFParserRegistry            - Registered service class org.eclipse.rdf4j.rio.turtle.TurtleParserFactory
06:16:55.523 [main                ] DEBUG org.eclipse.rdf4j.rio.RDFParserRegistry            - Registered service class org.eclipse.rdf4j.rio.turtlestar.TurtleStarParserFactory
06:16:55.525 [main                ] DEBUG org.eclipse.rdf4j.rio.RDFParserRegistry            - Registered service class org.eclipse.rdf4j.rio.rdfxml.RDFXMLParserFactory
06:16:55.536 [main                ] DEBUG org.eclipse.rdf4j.rio.RDFParserRegistry            - Registered service class org.eclipse.rdf4j.rio.n3.N3ParserFactory
06:16:55.594 [main                ] DEBUG org.eclipse.rdf4j.rio.DatatypeHandlerRegistry      - Registered service class org.eclipse.rdf4j.rio.datatypes.XMLSchemaDatatypeHandler
06:16:55.599 [main                ] DEBUG org.eclipse.rdf4j.rio.DatatypeHandlerRegistry      - Registered service class org.eclipse.rdf4j.rio.datatypes.RDFDatatypeHandler
06:16:55.603 [main                ] DEBUG org.eclipse.rdf4j.rio.DatatypeHandlerRegistry      - Registered service class org.eclipse.rdf4j.rio.datatypes.DBPediaDatatypeHandler
06:16:55.604 [main                ] DEBUG org.eclipse.rdf4j.rio.DatatypeHandlerRegistry      - Registered service class org.eclipse.rdf4j.rio.datatypes.VirtuosoGeometryDatatypeHandler
06:16:55.604 [main                ] DEBUG org.eclipse.rdf4j.rio.DatatypeHandlerRegistry      - Registered service class org.eclipse.rdf4j.rio.datatypes.GeoSPARQLDatatypeHandler
06:16:55.612 [main                ] DEBUG org.eclipse.rdf4j.rio.LanguageHandlerRegistry      - Registered service class org.eclipse.rdf4j.rio.languages.RFC3066LanguageHandler
06:16:55.612 [main                ] DEBUG org.eclipse.rdf4j.rio.LanguageHandlerRegistry      - Registered service class org.eclipse.rdf4j.rio.languages.BCP47LanguageHandler
06:16:59.525 [main                ] INFO  i.t.b.persistence.impl.DefaultPersistence          - exportToFile(target/test-results/export.n3)
06:17:01.888 [main                ] WARN  i.t.u.test.FileComparisonUtilsWithPathNormalizer   - Rewriting target/test-classes/triples.n3 ... (original file is preserved with .orig suffix)
06:17:01.901 [main                ] INFO  it.tidalwave.bluemarine2.util.PathNormalization    - Charset normalizer form: NFC
06:17:04.050 [main                ] WARN  i.t.u.test.FileComparisonUtilsWithPathNormalizer   - Rewriting target/test-results/export.n3 ... (original file is preserved with .orig suffix)
06:17:05.260 [main                ] INFO  it.tidalwave.util.test.FileComparisonUtils         - ******** Comparing files:
06:17:05.261 [main                ] INFO  it.tidalwave.util.test.FileComparisonUtils         - >>>> path is: /var/jenkins_home/jobs/blueMarine2_Metrics_OpenJDK_17/workspace/modules/Persistence/target/
06:17:05.261 [main                ] INFO  it.tidalwave.util.test.FileComparisonUtils         - >>>> exp is:  test-classes/triples.n3
06:17:05.261 [main                ] INFO  it.tidalwave.util.test.FileComparisonUtils         - >>>> act is:  test-results/export.n3
06:17:05.328 [main                ] INFO  i.t.b.persistence.impl.DefaultPersistenceTest      - TEST PASSED in 10795 msec
06:17:05.328 [main                ] INFO  i.t.b.persistence.impl.DefaultPersistenceTest      - 
06:17:05.353 [nvoker-afterMethod()] INFO  i.t.bluemarine2.commons.test.SpringTestSupport     - Closing Spring context...
06:17:05.356 [main                ] INFO  i.t.bluemarine2.commons.test.SpringTestSupport     - Spring configuration locations: [META-INF/PersistenceTestBeans.xml]
06:17:05.441 [main                ] TRACE it.tidalwave.messagebus.MessageBusHelper           - registerMessageListener(void it.tidalwave.bluemarine2.persistence.impl.DefaultPersistence.onPowerOnNotification(it.tidalwave.bluemarine2.message.PowerOnNotification) throws org.eclipse.rdf4j.repository.RepositoryException,java.io.IOException,org.eclipse.rdf4j.rio.RDFParseException)
06:17:05.442 [main                ] TRACE it.tidalwave.messagebus.MessageBusHelper           - registerMessageListener(void it.tidalwave.bluemarine2.persistence.impl.DefaultPersistence.onPowerOffNotification(it.tidalwave.bluemarine2.message.PowerOffNotification) throws org.eclipse.rdf4j.repository.RepositoryException,java.io.IOException,org.eclipse.rdf4j.rio.RDFParseException)
06:17:05.444 [main                ] INFO  i.t.bluemarine2.commons.test.SpringTestSupport     - >>>> bean names: [org.springframework.context.annotation.internalConfigurationAnnotationProcessor, org.springframework.context.annotation.internalAutowiredAnnotationProcessor, org.springframework.context.annotation.internalCommonAnnotationProcessor, org.springframework.context.event.internalEventListenerProcessor, org.springframework.context.event.internalEventListenerFactory, org.springframework.context.config.internalBeanConfigurerAspect, org.springframework.aop.config.internalAutoProxyCreator, underTest, applicationMessageBus]
06:17:05.458 [main                ] INFO  i.t.b.persistence.impl.DefaultPersistenceTest      - ************************************************************************************************************
06:17:05.458 [main                ] INFO  i.t.b.persistence.impl.DefaultPersistenceTest      - TEST "must use NativeStore and import when STORAGE FOLDER and IMPORT FILE configured and rename import file"
06:17:05.458 [main                ] INFO  i.t.b.persistence.impl.DefaultPersistenceTest      - ************************************************************************************************************
06:17:05.465 [main                ] INFO  i.t.b.persistence.impl.DefaultPersistence          - onPowerOnNotification(PowerOnNotification(properties={Key(name=it.tidalwave.bluemarine2.persistence.storagePath, type=interface java.nio.file.Path)=target/workspace/storageFolder, Key(name=it.tidalwave.bluemarine2.persistence.importFile, type=interface java.nio.file.Path)=target/workspace/triples.n3, Key(name=it.tidalwave.bluemarine2.persistence.renameImportFile, type=class java.lang.Boolean)=true}))
06:17:05.466 [main                ] INFO  i.t.b.persistence.impl.DefaultPersistence          - Disk storage at Optional[target/workspace/storageFolder]
06:17:05.466 [main                ] WARN  i.t.b.persistence.impl.DefaultPersistence          - Scratching store ...
06:17:05.466 [main                ] DEBUG org.eclipse.rdf4j.sail.nativerdf.NativeStore       - Initializing NativeStore...
06:17:05.467 [main                ] DEBUG org.eclipse.rdf4j.sail.nativerdf.NativeStore       - Data dir is target/workspace/storageFolder
06:17:05.483 [main                ] DEBUG org.eclipse.rdf4j.sail.nativerdf.TripleStore       - No indexes specified, using default indexes: spoc,posc
06:17:05.486 [main                ] TRACE org.eclipse.rdf4j.sail.nativerdf.TripleStore       - Initializing index 'spoc'...
06:17:05.513 [main                ] TRACE org.eclipse.rdf4j.sail.nativerdf.TripleStore       - Initializing index 'posc'...
06:17:05.514 [main                ] DEBUG org.eclipse.rdf4j.sail.nativerdf.ContextStore      - context index has not been created yet: context index file target/workspace/storageFolder/contexts.dat does not exist
06:17:05.514 [main                ] DEBUG org.eclipse.rdf4j.sail.nativerdf.ContextStore      - initializing context cache
06:17:05.514 [main                ] DEBUG org.eclipse.rdf4j.sail.nativerdf.ContextStore      - context index construction complete
06:17:05.515 [main                ] DEBUG org.eclipse.rdf4j.sail.nativerdf.NativeStore       - NativeStore initialized
06:17:05.515 [main                ] INFO  i.t.b.persistence.impl.DefaultPersistence          - Importing repository from target/workspace/triples.n3 ...
06:17:06.962 [main                ] INFO  i.t.b.persistence.impl.DefaultPersistence          - exportToFile(target/test-results/export.n3)
06:17:08.504 [main                ] WARN  i.t.u.test.FileComparisonUtilsWithPathNormalizer   - Rewriting target/test-classes/triples.n3 ... (original file is preserved with .orig suffix)
06:17:09.159 [main                ] WARN  i.t.u.test.FileComparisonUtilsWithPathNormalizer   - Rewriting target/test-results/export.n3 ... (original file is preserved with .orig suffix)
06:17:09.609 [main                ] INFO  it.tidalwave.util.test.FileComparisonUtils         - ******** Comparing files:
06:17:09.609 [main                ] INFO  it.tidalwave.util.test.FileComparisonUtils         - >>>> path is: /var/jenkins_home/jobs/blueMarine2_Metrics_OpenJDK_17/workspace/modules/Persistence/target/
06:17:09.617 [main                ] INFO  it.tidalwave.util.test.FileComparisonUtils         - >>>> exp is:  test-classes/triples.n3
06:17:09.617 [main                ] INFO  it.tidalwave.util.test.FileComparisonUtils         - >>>> act is:  test-results/export.n3
06:17:09.634 [main                ] INFO  i.t.b.persistence.impl.DefaultPersistenceTest      - TEST PASSED in 4176 msec
06:17:09.634 [main                ] INFO  i.t.b.persistence.impl.DefaultPersistenceTest      - 
06:17:09.649 [nvoker-afterMethod()] INFO  i.t.bluemarine2.commons.test.SpringTestSupport     - Closing Spring context...
06:17:09.652 [main                ] INFO  i.t.bluemarine2.commons.test.SpringTestSupport     - Spring configuration locations: [META-INF/PersistenceTestBeans.xml]
06:17:09.752 [main                ] TRACE it.tidalwave.messagebus.MessageBusHelper           - registerMessageListener(void it.tidalwave.bluemarine2.persistence.impl.DefaultPersistence.onPowerOnNotification(it.tidalwave.bluemarine2.message.PowerOnNotification) throws org.eclipse.rdf4j.repository.RepositoryException,java.io.IOException,org.eclipse.rdf4j.rio.RDFParseException)
06:17:09.753 [main                ] TRACE it.tidalwave.messagebus.MessageBusHelper           - registerMessageListener(void it.tidalwave.bluemarine2.persistence.impl.DefaultPersistence.onPowerOffNotification(it.tidalwave.bluemarine2.message.PowerOffNotification) throws org.eclipse.rdf4j.repository.RepositoryException,java.io.IOException,org.eclipse.rdf4j.rio.RDFParseException)
06:17:09.755 [main                ] INFO  i.t.bluemarine2.commons.test.SpringTestSupport     - >>>> bean names: [org.springframework.context.annotation.internalConfigurationAnnotationProcessor, org.springframework.context.annotation.internalAutowiredAnnotationProcessor, org.springframework.context.annotation.internalCommonAnnotationProcessor, org.springframework.context.event.internalEventListenerProcessor, org.springframework.context.event.internalEventListenerFactory, org.springframework.context.config.internalBeanConfigurerAspect, org.springframework.aop.config.internalAutoProxyCreator, underTest, applicationMessageBus]
06:17:09.767 [main                ] INFO  i.t.b.persistence.impl.DefaultPersistenceTest      - **********************************************************
06:17:09.768 [main                ] INFO  i.t.b.persistence.impl.DefaultPersistenceTest      - TEST "must use NativeStore when STORAGE FOLDER configured"
06:17:09.768 [main                ] INFO  i.t.b.persistence.impl.DefaultPersistenceTest      - **********************************************************
06:17:09.768 [main                ] INFO  i.t.b.persistence.impl.DefaultPersistence          - onPowerOnNotification(PowerOnNotification(properties={Key(name=it.tidalwave.bluemarine2.persistence.storagePath, type=interface java.nio.file.Path)=target/workspace/storageFolder}))
06:17:09.769 [main                ] INFO  i.t.b.persistence.impl.DefaultPersistence          - Disk storage at Optional[target/workspace/storageFolder]
06:17:09.769 [main                ] DEBUG org.eclipse.rdf4j.sail.nativerdf.NativeStore       - Initializing NativeStore...
06:17:09.778 [main                ] DEBUG org.eclipse.rdf4j.sail.nativerdf.NativeStore       - Data dir is target/workspace/storageFolder
06:17:09.782 [main                ] DEBUG org.eclipse.rdf4j.sail.nativerdf.TripleStore       - No indexes specified, using default indexes: spoc,posc
06:17:09.783 [main                ] TRACE org.eclipse.rdf4j.sail.nativerdf.TripleStore       - Initializing index 'spoc'...
06:17:09.783 [main                ] TRACE org.eclipse.rdf4j.sail.nativerdf.TripleStore       - Initializing index 'posc'...
06:17:09.783 [main                ] DEBUG org.eclipse.rdf4j.sail.nativerdf.ContextStore      - context index has not been created yet: context index file target/workspace/storageFolder/contexts.dat does not exist
06:17:09.784 [main                ] DEBUG org.eclipse.rdf4j.sail.nativerdf.ContextStore      - initializing context cache
06:17:09.784 [main                ] DEBUG org.eclipse.rdf4j.sail.nativerdf.ContextStore      - context index construction complete
06:17:09.784 [main                ] DEBUG org.eclipse.rdf4j.sail.nativerdf.NativeStore       - NativeStore initialized
06:17:09.784 [main                ] INFO  i.t.b.persistence.impl.DefaultPersistence          - exportToFile(target/test-results/export.n3)
06:17:09.794 [main                ] INFO  it.tidalwave.util.test.FileComparisonUtils         - ******** Comparing files:
06:17:09.795 [main                ] INFO  it.tidalwave.util.test.FileComparisonUtils         - >>>> path is: /var/jenkins_home/jobs/blueMarine2_Metrics_OpenJDK_17/workspace/modules/Persistence/target/
06:17:09.795 [main                ] INFO  it.tidalwave.util.test.FileComparisonUtils         - >>>> exp is:  test-classes/empty.n3
06:17:09.795 [main                ] INFO  it.tidalwave.util.test.FileComparisonUtils         - >>>> act is:  test-results/export.n3
06:17:09.796 [main                ] INFO  i.t.b.persistence.impl.DefaultPersistenceTest      - TEST PASSED in 28 msec
06:17:09.796 [main                ] INFO  i.t.b.persistence.impl.DefaultPersistenceTest      - 
06:17:09.803 [nvoker-afterMethod()] INFO  i.t.bluemarine2.commons.test.SpringTestSupport     - Closing Spring context...
06:17:09.805 [main                ] INFO  i.t.bluemarine2.commons.test.SpringTestSupport     - Spring configuration locations: [META-INF/PersistenceTestBeans.xml]
06:17:10.002 [main                ] TRACE it.tidalwave.messagebus.MessageBusHelper           - registerMessageListener(void it.tidalwave.bluemarine2.persistence.impl.DefaultPersistence.onPowerOnNotification(it.tidalwave.bluemarine2.message.PowerOnNotification) throws org.eclipse.rdf4j.repository.RepositoryException,java.io.IOException,org.eclipse.rdf4j.rio.RDFParseException)
06:17:10.003 [main                ] TRACE it.tidalwave.messagebus.MessageBusHelper           - registerMessageListener(void it.tidalwave.bluemarine2.persistence.impl.DefaultPersistence.onPowerOffNotification(it.tidalwave.bluemarine2.message.PowerOffNotification) throws org.eclipse.rdf4j.repository.RepositoryException,java.io.IOException,org.eclipse.rdf4j.rio.RDFParseException)
06:17:10.005 [main                ] INFO  i.t.bluemarine2.commons.test.SpringTestSupport     - >>>> bean names: [org.springframework.context.annotation.internalConfigurationAnnotationProcessor, org.springframework.context.annotation.internalAutowiredAnnotationProcessor, org.springframework.context.annotation.internalCommonAnnotationProcessor, org.springframework.context.event.internalEventListenerProcessor, org.springframework.context.event.internalEventListenerFactory, org.springframework.context.config.internalBeanConfigurerAspect, org.springframework.aop.config.internalAutoProxyCreator, underTest, applicationMessageBus]
06:17:10.008 [main                ] INFO  i.t.b.persistence.impl.DefaultPersistenceTest      - **************************************************************************
06:17:10.008 [main                ] INFO  i.t.b.persistence.impl.DefaultPersistenceTest      - TEST "must use NativeStore when STORAGE FOLDER configured and not scratch"
06:17:10.008 [main                ] INFO  i.t.b.persistence.impl.DefaultPersistenceTest      - **************************************************************************
06:17:10.009 [main                ] DEBUG org.eclipse.rdf4j.sail.nativerdf.NativeStore       - Initializing NativeStore...
06:17:10.010 [main                ] DEBUG org.eclipse.rdf4j.sail.nativerdf.NativeStore       - Data dir is target/workspace/storageFolder
06:17:10.014 [main                ] DEBUG org.eclipse.rdf4j.sail.nativerdf.TripleStore       - No indexes specified, using default indexes: spoc,posc
06:17:10.014 [main                ] TRACE org.eclipse.rdf4j.sail.nativerdf.TripleStore       - Initializing index 'spoc'...
06:17:10.027 [main                ] TRACE org.eclipse.rdf4j.sail.nativerdf.TripleStore       - Initializing index 'posc'...
06:17:10.028 [main                ] DEBUG org.eclipse.rdf4j.sail.nativerdf.ContextStore      - context index has not been created yet: context index file target/workspace/storageFolder/contexts.dat does not exist
06:17:10.028 [main                ] DEBUG org.eclipse.rdf4j.sail.nativerdf.ContextStore      - initializing context cache
06:17:10.029 [main                ] DEBUG org.eclipse.rdf4j.sail.nativerdf.ContextStore      - context index construction complete
06:17:10.029 [main                ] DEBUG org.eclipse.rdf4j.sail.nativerdf.NativeStore       - NativeStore initialized
06:17:11.626 [main                ] DEBUG org.eclipse.rdf4j.sail.nativerdf.NativeStore       - Shutting down NativeStore...
06:17:11.627 [main                ] DEBUG org.eclipse.rdf4j.sail.nativerdf.NativeStore       - NativeStore shut down
06:17:11.628 [main                ] DEBUG org.eclipse.rdf4j.sail.nativerdf.NativeStore       - NativeStore shut down
06:17:11.628 [main                ] INFO  i.t.b.persistence.impl.DefaultPersistence          - onPowerOnNotification(PowerOnNotification(properties={Key(name=it.tidalwave.bluemarine2.persistence.storagePath, type=interface java.nio.file.Path)=target/workspace/storageFolder}))
06:17:11.628 [main                ] INFO  i.t.b.persistence.impl.DefaultPersistence          - Disk storage at Optional[target/workspace/storageFolder]
06:17:11.638 [main                ] DEBUG org.eclipse.rdf4j.sail.nativerdf.NativeStore       - Initializing NativeStore...
06:17:11.641 [main                ] DEBUG org.eclipse.rdf4j.sail.nativerdf.NativeStore       - Data dir is target/workspace/storageFolder
06:17:11.646 [main                ] TRACE org.eclipse.rdf4j.sail.nativerdf.TripleStore       - Initializing index 'spoc'...
06:17:11.650 [main                ] TRACE org.eclipse.rdf4j.sail.nativerdf.TripleStore       - Initializing index 'posc'...
06:17:11.650 [main                ] TRACE org.eclipse.rdf4j.sail.nativerdf.TripleStore       - No uncompleted transactions found
06:17:11.650 [main                ] DEBUG org.eclipse.rdf4j.sail.nativerdf.NativeStore       - NativeStore initialized
06:17:11.651 [main                ] INFO  i.t.b.persistence.impl.DefaultPersistence          - exportToFile(target/test-results/export.n3)
06:17:12.645 [main                ] WARN  i.t.u.test.FileComparisonUtilsWithPathNormalizer   - Rewriting target/test-classes/triples.n3 ... (original file is preserved with .orig suffix)
06:17:13.875 [main                ] WARN  i.t.u.test.FileComparisonUtilsWithPathNormalizer   - Rewriting target/test-results/export.n3 ... (original file is preserved with .orig suffix)
06:17:15.161 [main                ] INFO  it.tidalwave.util.test.FileComparisonUtils         - ******** Comparing files:
06:17:15.161 [main                ] INFO  it.tidalwave.util.test.FileComparisonUtils         - >>>> path is: /var/jenkins_home/jobs/blueMarine2_Metrics_OpenJDK_17/workspace/modules/Persistence/target/
06:17:15.161 [main                ] INFO  it.tidalwave.util.test.FileComparisonUtils         - >>>> exp is:  test-classes/triples.n3
06:17:15.161 [main                ] INFO  it.tidalwave.util.test.FileComparisonUtils         - >>>> act is:  test-results/export.n3
06:17:15.174 [main                ] INFO  i.t.b.persistence.impl.DefaultPersistenceTest      - TEST PASSED in 5165 msec
06:17:15.174 [main                ] INFO  i.t.b.persistence.impl.DefaultPersistenceTest      - 
06:17:15.205 [nvoker-afterMethod()] INFO  i.t.bluemarine2.commons.test.SpringTestSupport     - Closing Spring context...
06:17:15.254 [main                ] INFO  i.t.b.persistence.impl.DefaultPersistenceTest      - FINISHED TESTS OF it.tidalwave.bluemarine2.persistence.impl.DefaultPersistenceTest
[INFO] Tests run: 5, Failures: 0, Errors: 0, Skipped: 0, Time elapsed: 29.263 s - in it.tidalwave.bluemarine2.persistence.impl.DefaultPersistenceTest
[INFO] 
[INFO] Results:
[INFO] 
[INFO] Tests run: 5, Failures: 0, Errors: 0, Skipped: 0
[INFO] 
[JENKINS] Recording test results
[INFO] 
[INFO] --- jacoco-maven-plugin:0.8.7:report (report) @ it-tidalwave-bluemarine2-persistence ---
[INFO] Loading execution data file /var/jenkins_home/jobs/blueMarine2_Metrics_OpenJDK_17/workspace/modules/Persistence/target/jacoco.exec
[INFO] Analyzed bundle 'blueMarine II :: Persistence' with 4 classes
[INFO] 
[INFO] --- maven-jar-plugin:3.2.0:jar (default-jar) @ it-tidalwave-bluemarine2-persistence ---
[INFO] Building jar: /var/jenkins_home/jobs/blueMarine2_Metrics_OpenJDK_17/workspace/modules/Persistence/target/it-tidalwave-bluemarine2-persistence-1.1-ALPHA-2-SNAPSHOT.5bd725d04573.jar
[INFO] 
[INFO] --- maven-jar-plugin:3.2.0:test-jar (default-test-jar) @ it-tidalwave-bluemarine2-persistence ---
[INFO] Building jar: /var/jenkins_home/jobs/blueMarine2_Metrics_OpenJDK_17/workspace/modules/Persistence/target/it-tidalwave-bluemarine2-persistence-1.1-ALPHA-2-SNAPSHOT.5bd725d04573-tests.jar
[INFO] 
[INFO] --- maven-install-plugin:3.0.0-M1:install (default-install) @ it-tidalwave-bluemarine2-persistence ---
[INFO] Installing /var/jenkins_home/jobs/blueMarine2_Metrics_OpenJDK_17/workspace/modules/Persistence/target/it-tidalwave-bluemarine2-persistence-1.1-ALPHA-2-SNAPSHOT.5bd725d04573.jar to /var/jenkins_home/jobs/blueMarine2_Metrics_OpenJDK_17/workspace@tmp/repository/it/tidalwave/bluemarine2/it-tidalwave-bluemarine2-persistence/1.1-ALPHA-2-SNAPSHOT/it-tidalwave-bluemarine2-persistence-1.1-ALPHA-2-SNAPSHOT.jar
[INFO] Installing /var/jenkins_home/jobs/blueMarine2_Metrics_OpenJDK_17/workspace/modules/Persistence/pom.xml to /var/jenkins_home/jobs/blueMarine2_Metrics_OpenJDK_17/workspace@tmp/repository/it/tidalwave/bluemarine2/it-tidalwave-bluemarine2-persistence/1.1-ALPHA-2-SNAPSHOT/it-tidalwave-bluemarine2-persistence-1.1-ALPHA-2-SNAPSHOT.pom
[INFO] Installing /var/jenkins_home/jobs/blueMarine2_Metrics_OpenJDK_17/workspace/modules/Persistence/target/it-tidalwave-bluemarine2-persistence-1.1-ALPHA-2-SNAPSHOT.5bd725d04573-tests.jar to /var/jenkins_home/jobs/blueMarine2_Metrics_OpenJDK_17/workspace@tmp/repository/it/tidalwave/bluemarine2/it-tidalwave-bluemarine2-persistence/1.1-ALPHA-2-SNAPSHOT/it-tidalwave-bluemarine2-persistence-1.1-ALPHA-2-SNAPSHOT-tests.jar
[INFO] 
[INFO] >>> maven-dependency-plugin:3.1.2:analyze (default-cli) > test-compile @ it-tidalwave-bluemarine2-persistence >>>
[INFO] 
[INFO] --- buildnumber-maven-plugin:1.4:create (default) @ it-tidalwave-bluemarine2-persistence ---
[INFO] ShortRevision tag detected. The value is '12'.
[INFO] Executing: /bin/sh -c cd '/var/jenkins_home/jobs/blueMarine2_Metrics_OpenJDK_17/workspace/modules/Persistence' && 'git' 'rev-parse' '--verify' '--short=12' 'HEAD'
[INFO] Working directory: /var/jenkins_home/jobs/blueMarine2_Metrics_OpenJDK_17/workspace/modules/Persistence
[INFO] Storing buildNumber: 5bd725d04573 at timestamp: 1660537037292
[WARNING] Cannot get the branch information from the git repository: 
Detecting the current branch failed: fatal: ref HEAD is not a symbolic ref

[INFO] ShortRevision tag detected. The value is '12'.
[INFO] Executing: /bin/sh -c cd '/var/jenkins_home/jobs/blueMarine2_Metrics_OpenJDK_17/workspace/modules/Persistence' && 'git' 'rev-parse' '--verify' '--short=12' 'HEAD'
[INFO] Working directory: /var/jenkins_home/jobs/blueMarine2_Metrics_OpenJDK_17/workspace/modules/Persistence
[INFO] Storing buildScmBranch: UNKNOWN
[INFO] 
[INFO] --- maven-enforcer-plugin:3.0.0-M3:enforce (enforce-maven) @ it-tidalwave-bluemarine2-persistence ---
[INFO] 
[INFO] --- maven-enforcer-plugin:3.0.0-M3:enforce (enforce-banned-dependencies) @ it-tidalwave-bluemarine2-persistence ---
[INFO] 
[INFO] --- maven-antrun-plugin:3.0.0:run (generate-and-print-build-description) @ it-tidalwave-bluemarine2-persistence ---
[INFO] Executing tasks
[INFO]      [echo] DESCRIPTION: origin/master 1.1-ALPHA-2-SNAPSHOT 5bd725d04573
[INFO]      [echo] Java Version: 17.0.1 -source 11 -target 11 -release 11
[INFO] Executed tasks
[INFO] 
[INFO] --- jacoco-maven-plugin:0.8.7:prepare-agent (prepare-agent) @ it-tidalwave-bluemarine2-persistence ---
[INFO] tft.test.jacoco.argLine set to -javaagent:/var/jenkins_home/jobs/blueMarine2_Metrics_OpenJDK_17/workspace@tmp/repository/org/jacoco/org.jacoco.agent/0.8.7/org.jacoco.agent-0.8.7-runtime.jar=destfile=/var/jenkins_home/jobs/blueMarine2_Metrics_OpenJDK_17/workspace/modules/Persistence/target/jacoco.exec
[INFO] 
[INFO] --- maven-antrun-plugin:3.0.0:run (create-unwoven-classes-dirs) @ it-tidalwave-bluemarine2-persistence ---
[INFO] Executing tasks
[INFO] Executed tasks
[INFO] 
[INFO] --- maven-resources-plugin:3.2.0:resources (default-resources) @ it-tidalwave-bluemarine2-persistence ---
[INFO] Using 'UTF-8' encoding to copy filtered resources.
[INFO] Using 'UTF-8' encoding to copy filtered properties files.
[INFO] Copying 1 resource
[INFO] 
[INFO] --- maven-compiler-plugin:3.8.1:compile (default-compile) @ it-tidalwave-bluemarine2-persistence ---
[INFO] Changes detected - recompiling the module!
[INFO] Compiling 4 source files to /var/jenkins_home/jobs/blueMarine2_Metrics_OpenJDK_17/workspace/modules/Persistence/target/unwoven-classes
[WARNING] No processor claimed any of these annotations: /javax.annotation.Nonnull,/it.tidalwave.util.annotation.VisibleForTesting,/it.tidalwave.messagebus.annotation.ListensTo,/it.tidalwave.messagebus.annotation.SimpleMessageSubscriber,/javax.inject.Inject
[WARNING] /var/jenkins_home/jobs/blueMarine2_Metrics_OpenJDK_17/workspace/modules/Persistence/src/main/java/it/tidalwave/bluemarine2/persistence/impl/RepositoryDelegate.java:[60,16] [deprecation] initialize() in Repository has been deprecated
[WARNING] /var/jenkins_home/jobs/blueMarine2_Metrics_OpenJDK_17/workspace/modules/Persistence/src/main/java/it/tidalwave/bluemarine2/persistence/impl/DefaultPersistence.java:[128,18] [deprecation] initialize() in Repository has been deprecated
[INFO] 
[INFO] --- aspectj-maven-plugin:1.11:compile (weave-classes) @ it-tidalwave-bluemarine2-persistence ---
[INFO] Showing AJC message detail for messages of types: [error, warning, fail]
[INFO] 
[INFO] --- maven-resources-plugin:3.2.0:testResources (default-testResources) @ it-tidalwave-bluemarine2-persistence ---
[INFO] Using 'UTF-8' encoding to copy filtered resources.
[INFO] Using 'UTF-8' encoding to copy filtered properties files.
[INFO] Copying 3 resources
[INFO] 
[INFO] --- maven-compiler-plugin:3.8.1:testCompile (default-testCompile) @ it-tidalwave-bluemarine2-persistence ---
[INFO] Changes detected - recompiling the module!
[INFO] Compiling 1 source file to /var/jenkins_home/jobs/blueMarine2_Metrics_OpenJDK_17/workspace/modules/Persistence/target/unwoven-test-classes
[WARNING] No processor claimed any of these annotations: /org.testng.annotations.Test,/javax.annotation.Nonnull,/org.testng.annotations.BeforeMethod
[WARNING] /var/jenkins_home/jobs/blueMarine2_Metrics_OpenJDK_17/workspace/modules/Persistence/src/test/java/it/tidalwave/bluemarine2/persistence/impl/DefaultPersistenceTest.java:[232,18] [deprecation] initialize() in Repository has been deprecated
[WARNING] Failed to getClass for org.apache.maven.plugins.dependency.analyze.AnalyzeMojo
[INFO] 
[INFO] <<< maven-dependency-plugin:3.1.2:analyze (default-cli) < test-compile @ it-tidalwave-bluemarine2-persistence <<<
[INFO] 
[INFO] 
[INFO] --- maven-dependency-plugin:3.1.2:analyze (default-cli) @ it-tidalwave-bluemarine2-persistence ---
[WARNING] Used undeclared dependencies found:
[WARNING]    com.google.code.findbugs:jsr305:jar:3.0.2:compile
[WARNING]    org.eclipse.rdf4j:rdf4j-rio-api:jar:3.6.2:compile
[WARNING]    com.github.spotbugs:spotbugs-annotations:jar:3.1.9:compile
[WARNING]    org.hamcrest:hamcrest-core:jar:1.3:test
[WARNING]    org.eclipse.rdf4j:rdf4j-model-api:jar:3.6.2:compile
[WARNING]    org.eclipse.rdf4j:rdf4j-repository-api:jar:3.6.2:compile
[WARNING]    org.eclipse.rdf4j:rdf4j-sail-api:jar:3.6.2:compile
[WARNING]    it.tidalwave.thesefoolishthings:it-tidalwave-util:jar:3.2-ALPHA-11:compile
[WARNING]    commons-io:commons-io:jar:2.7:compile
[WARNING] Unused declared dependencies found:
[WARNING]    it.tidalwave.bluemarine2:it-tidalwave-bluemarine2-model:jar:1.1-ALPHA-2-SNAPSHOT:compile
[WARNING]    it.tidalwave.thesefoolishthings:it-tidalwave-role-spring:jar:3.2-ALPHA-11:compile
[WARNING]    org.eclipse.rdf4j:rdf4j-rio-rdfxml:jar:3.6.2:compile
[WARNING]    org.springframework:spring-aspects:jar:5.3.1:compile
[WARNING]    org.projectlombok:lombok:jar:1.18.22:provided
[WARNING]    org.slf4j:jcl-over-slf4j:jar:1.7.30:runtime
[WARNING]    org.slf4j:jul-to-slf4j:jar:1.7.30:runtime
[WARNING]    ch.qos.logback:logback-classic:jar:1.2.3:runtime
[WARNING]    it.tidalwave.thesefoolishthings:it-tidalwave-util-test:jar:3.2-ALPHA-11:test
[WARNING]    org.hamcrest:hamcrest-all:jar:1.3:test
[WARNING]    org.mockito:mockito-core:jar:3.8.0:test
[WARNING]    org.aspectj:aspectjrt:jar:1.9.6:compile
[JENKINS] Archiving disabled
Started calculate disk usage of build
Finished Calculation of disk usage of build in 0 seconds
Started calculate disk usage of workspace
Finished Calculation of disk usage of workspace in 0 seconds
[INFO] 
[INFO] ----< it.tidalwave.bluemarine2:it-tidalwave-bluemarine2-vocabulary >----
[INFO] Building blueMarine II :: Vocabulary 1.1-ALPHA-2-SNAPSHOT         [8/26]
[INFO] --------------------------------[ jar ]---------------------------------
[INFO] 
[INFO] --- maven-clean-plugin:3.1.0:clean (default-clean) @ it-tidalwave-bluemarine2-vocabulary ---
[INFO] 
[INFO] --- buildnumber-maven-plugin:1.4:create (default) @ it-tidalwave-bluemarine2-vocabulary ---
[INFO] ShortRevision tag detected. The value is '12'.
[INFO] Executing: /bin/sh -c cd '/var/jenkins_home/jobs/blueMarine2_Metrics_OpenJDK_17/workspace/modules/Vocabulary' && 'git' 'rev-parse' '--verify' '--short=12' 'HEAD'
[INFO] Working directory: /var/jenkins_home/jobs/blueMarine2_Metrics_OpenJDK_17/workspace/modules/Vocabulary
[INFO] Storing buildNumber: 5bd725d04573 at timestamp: 1660537051519
[WARNING] Cannot get the branch information from the git repository: 
Detecting the current branch failed: fatal: ref HEAD is not a symbolic ref

[INFO] ShortRevision tag detected. The value is '12'.
[INFO] Executing: /bin/sh -c cd '/var/jenkins_home/jobs/blueMarine2_Metrics_OpenJDK_17/workspace/modules/Vocabulary' && 'git' 'rev-parse' '--verify' '--short=12' 'HEAD'
[INFO] Working directory: /var/jenkins_home/jobs/blueMarine2_Metrics_OpenJDK_17/workspace/modules/Vocabulary
[INFO] Storing buildScmBranch: UNKNOWN
[INFO] 
[INFO] --- maven-enforcer-plugin:3.0.0-M3:enforce (enforce-maven) @ it-tidalwave-bluemarine2-vocabulary ---
[INFO] 
[INFO] --- maven-enforcer-plugin:3.0.0-M3:enforce (enforce-banned-dependencies) @ it-tidalwave-bluemarine2-vocabulary ---
[INFO] 
[INFO] --- maven-antrun-plugin:3.0.0:run (generate-and-print-build-description) @ it-tidalwave-bluemarine2-vocabulary ---
[INFO] Executing tasks
[INFO]      [echo] DESCRIPTION: origin/master 1.1-ALPHA-2-SNAPSHOT 5bd725d04573
[INFO]      [echo] Java Version: 17.0.1 -source 11 -target 11 -release 11
[INFO] Executed tasks
[INFO] 
[INFO] --- jacoco-maven-plugin:0.8.7:prepare-agent (prepare-agent) @ it-tidalwave-bluemarine2-vocabulary ---
[INFO] tft.test.jacoco.argLine set to -javaagent:/var/jenkins_home/jobs/blueMarine2_Metrics_OpenJDK_17/workspace@tmp/repository/org/jacoco/org.jacoco.agent/0.8.7/org.jacoco.agent-0.8.7-runtime.jar=destfile=/var/jenkins_home/jobs/blueMarine2_Metrics_OpenJDK_17/workspace/modules/Vocabulary/target/jacoco.exec
[INFO] 
[INFO] --- maven-resources-plugin:3.2.0:resources (default-resources) @ it-tidalwave-bluemarine2-vocabulary ---
[INFO] Using 'UTF-8' encoding to copy filtered resources.
[INFO] Using 'UTF-8' encoding to copy filtered properties files.
[INFO] skip non existing resourceDirectory /var/jenkins_home/jobs/blueMarine2_Metrics_OpenJDK_17/workspace/modules/Vocabulary/src/main/resources
[INFO] 
[INFO] --- maven-compiler-plugin:3.8.1:compile (default-compile) @ it-tidalwave-bluemarine2-vocabulary ---
[INFO] Changes detected - recompiling the module!
[INFO] Compiling 4 source files to /var/jenkins_home/jobs/blueMarine2_Metrics_OpenJDK_17/workspace/modules/Vocabulary/target/classes
[WARNING] No processor claimed any of these annotations: /javax.annotation.Nonnull
[INFO] 
[INFO] --- maven-resources-plugin:3.2.0:testResources (default-testResources) @ it-tidalwave-bluemarine2-vocabulary ---
[INFO] Using 'UTF-8' encoding to copy filtered resources.
[INFO] Using 'UTF-8' encoding to copy filtered properties files.
[INFO] skip non existing resourceDirectory /var/jenkins_home/jobs/blueMarine2_Metrics_OpenJDK_17/workspace/modules/Vocabulary/src/test/resources
[INFO] 
[INFO] --- maven-compiler-plugin:3.8.1:testCompile (default-testCompile) @ it-tidalwave-bluemarine2-vocabulary ---
[INFO] No sources to compile
[INFO] 
[INFO] --- maven-surefire-plugin:3.0.0-M5:test (default-test) @ it-tidalwave-bluemarine2-vocabulary ---
[INFO] No tests to run.
[JENKINS] Recording test results
[INFO] 
[INFO] --- jacoco-maven-plugin:0.8.7:report (report) @ it-tidalwave-bluemarine2-vocabulary ---
[INFO] Skipping JaCoCo execution due to missing execution data file.
[INFO] 
[INFO] --- maven-jar-plugin:3.2.0:jar (default-jar) @ it-tidalwave-bluemarine2-vocabulary ---
[INFO] Building jar: /var/jenkins_home/jobs/blueMarine2_Metrics_OpenJDK_17/workspace/modules/Vocabulary/target/it-tidalwave-bluemarine2-vocabulary-1.1-ALPHA-2-SNAPSHOT.5bd725d04573.jar
[INFO] 
[INFO] --- maven-jar-plugin:3.2.0:test-jar (default-test-jar) @ it-tidalwave-bluemarine2-vocabulary ---
[INFO] Skipping packaging of the test-jar
[INFO] 
[INFO] --- maven-install-plugin:3.0.0-M1:install (default-install) @ it-tidalwave-bluemarine2-vocabulary ---
[INFO] Installing /var/jenkins_home/jobs/blueMarine2_Metrics_OpenJDK_17/workspace/modules/Vocabulary/target/it-tidalwave-bluemarine2-vocabulary-1.1-ALPHA-2-SNAPSHOT.5bd725d04573.jar to /var/jenkins_home/jobs/blueMarine2_Metrics_OpenJDK_17/workspace@tmp/repository/it/tidalwave/bluemarine2/it-tidalwave-bluemarine2-vocabulary/1.1-ALPHA-2-SNAPSHOT/it-tidalwave-bluemarine2-vocabulary-1.1-ALPHA-2-SNAPSHOT.jar
[INFO] Installing /var/jenkins_home/jobs/blueMarine2_Metrics_OpenJDK_17/workspace/modules/Vocabulary/pom.xml to /var/jenkins_home/jobs/blueMarine2_Metrics_OpenJDK_17/workspace@tmp/repository/it/tidalwave/bluemarine2/it-tidalwave-bluemarine2-vocabulary/1.1-ALPHA-2-SNAPSHOT/it-tidalwave-bluemarine2-vocabulary-1.1-ALPHA-2-SNAPSHOT.pom
[INFO] 
[INFO] >>> maven-dependency-plugin:3.1.2:analyze (default-cli) > test-compile @ it-tidalwave-bluemarine2-vocabulary >>>
[INFO] 
[INFO] --- buildnumber-maven-plugin:1.4:create (default) @ it-tidalwave-bluemarine2-vocabulary ---
[INFO] ShortRevision tag detected. The value is '12'.
[INFO] Executing: /bin/sh -c cd '/var/jenkins_home/jobs/blueMarine2_Metrics_OpenJDK_17/workspace/modules/Vocabulary' && 'git' 'rev-parse' '--verify' '--short=12' 'HEAD'
[INFO] Working directory: /var/jenkins_home/jobs/blueMarine2_Metrics_OpenJDK_17/workspace/modules/Vocabulary
[INFO] Storing buildNumber: 5bd725d04573 at timestamp: 1660537058160
[WARNING] Cannot get the branch information from the git repository: 
Detecting the current branch failed: fatal: ref HEAD is not a symbolic ref

[INFO] ShortRevision tag detected. The value is '12'.
[INFO] Executing: /bin/sh -c cd '/var/jenkins_home/jobs/blueMarine2_Metrics_OpenJDK_17/workspace/modules/Vocabulary' && 'git' 'rev-parse' '--verify' '--short=12' 'HEAD'
[INFO] Working directory: /var/jenkins_home/jobs/blueMarine2_Metrics_OpenJDK_17/workspace/modules/Vocabulary
[INFO] Storing buildScmBranch: UNKNOWN
[INFO] 
[INFO] --- maven-enforcer-plugin:3.0.0-M3:enforce (enforce-maven) @ it-tidalwave-bluemarine2-vocabulary ---
[INFO] 
[INFO] --- maven-enforcer-plugin:3.0.0-M3:enforce (enforce-banned-dependencies) @ it-tidalwave-bluemarine2-vocabulary ---
[INFO] 
[INFO] --- maven-antrun-plugin:3.0.0:run (generate-and-print-build-description) @ it-tidalwave-bluemarine2-vocabulary ---
[INFO] Executing tasks
[INFO]      [echo] DESCRIPTION: origin/master 1.1-ALPHA-2-SNAPSHOT 5bd725d04573
[INFO]      [echo] Java Version: 17.0.1 -source 11 -target 11 -release 11
[INFO] Executed tasks
[INFO] 
[INFO] --- jacoco-maven-plugin:0.8.7:prepare-agent (prepare-agent) @ it-tidalwave-bluemarine2-vocabulary ---
[INFO] tft.test.jacoco.argLine set to -javaagent:/var/jenkins_home/jobs/blueMarine2_Metrics_OpenJDK_17/workspace@tmp/repository/org/jacoco/org.jacoco.agent/0.8.7/org.jacoco.agent-0.8.7-runtime.jar=destfile=/var/jenkins_home/jobs/blueMarine2_Metrics_OpenJDK_17/workspace/modules/Vocabulary/target/jacoco.exec
[INFO] 
[INFO] --- maven-resources-plugin:3.2.0:resources (default-resources) @ it-tidalwave-bluemarine2-vocabulary ---
[INFO] Using 'UTF-8' encoding to copy filtered resources.
[INFO] Using 'UTF-8' encoding to copy filtered properties files.
[INFO] skip non existing resourceDirectory /var/jenkins_home/jobs/blueMarine2_Metrics_OpenJDK_17/workspace/modules/Vocabulary/src/main/resources
[INFO] 
[INFO] --- maven-compiler-plugin:3.8.1:compile (default-compile) @ it-tidalwave-bluemarine2-vocabulary ---
[INFO] Changes detected - recompiling the module!
[INFO] Compiling 4 source files to /var/jenkins_home/jobs/blueMarine2_Metrics_OpenJDK_17/workspace/modules/Vocabulary/target/classes
[WARNING] No processor claimed any of these annotations: /javax.annotation.Nonnull
[INFO] 
[INFO] --- maven-resources-plugin:3.2.0:testResources (default-testResources) @ it-tidalwave-bluemarine2-vocabulary ---
[INFO] Using 'UTF-8' encoding to copy filtered resources.
[INFO] Using 'UTF-8' encoding to copy filtered properties files.
[INFO] skip non existing resourceDirectory /var/jenkins_home/jobs/blueMarine2_Metrics_OpenJDK_17/workspace/modules/Vocabulary/src/test/resources
[INFO] 
[INFO] --- maven-compiler-plugin:3.8.1:testCompile (default-testCompile) @ it-tidalwave-bluemarine2-vocabulary ---
[INFO] No sources to compile
[WARNING] Failed to getClass for org.apache.maven.plugins.dependency.analyze.AnalyzeMojo
[INFO] 
[INFO] <<< maven-dependency-plugin:3.1.2:analyze (default-cli) < test-compile @ it-tidalwave-bluemarine2-vocabulary <<<
[INFO] 
[INFO] 
[INFO] --- maven-dependency-plugin:3.1.2:analyze (default-cli) @ it-tidalwave-bluemarine2-vocabulary ---
[WARNING] Used undeclared dependencies found:
[WARNING]    com.google.code.findbugs:jsr305:jar:3.0.2:compile
[WARNING]    com.github.spotbugs:spotbugs-annotations:jar:3.1.9:compile
[WARNING]    org.eclipse.rdf4j:rdf4j-model:jar:3.6.2:compile
[WARNING]    org.eclipse.rdf4j:rdf4j-model-api:jar:3.6.2:compile
[WARNING] Unused declared dependencies found:
[WARNING]    org.eclipse.rdf4j:rdf4j-repository-api:jar:3.6.2:compile
[WARNING]    javax.inject:javax.inject:jar:1:compile
[WARNING]    org.slf4j:slf4j-api:jar:1.7.30:compile
[WARNING]    org.projectlombok:lombok:jar:1.18.22:provided
[WARNING]    org.slf4j:jcl-over-slf4j:jar:1.7.30:runtime
[WARNING]    org.slf4j:jul-to-slf4j:jar:1.7.30:runtime
[WARNING]    ch.qos.logback:logback-classic:jar:1.2.3:runtime
[WARNING]    it.tidalwave.thesefoolishthings:it-tidalwave-util-test:jar:3.2-ALPHA-11:test
[WARNING]    org.testng:testng:jar:6.9.10:test
[WARNING]    org.hamcrest:hamcrest-all:jar:1.3:test
[WARNING]    org.mockito:mockito-core:jar:3.8.0:test
[JENKINS] Archiving disabled
Started calculate disk usage of build
Finished Calculation of disk usage of build in 0 seconds
Started calculate disk usage of workspace
Finished Calculation of disk usage of workspace in 0 seconds
[INFO] 
[INFO] --< it.tidalwave.bluemarine2:it-tidalwave-bluemarine2-musicbrainz-datamodel >--
[INFO] Building blueMarine II :: MusicBrainz :: Data Model 1.1-ALPHA-2-SNAPSHOT [9/26]
[INFO] --------------------------------[ jar ]---------------------------------
[INFO] 
[INFO] --- maven-clean-plugin:3.1.0:clean (default-clean) @ it-tidalwave-bluemarine2-musicbrainz-datamodel ---
[INFO] 
[INFO] --- buildnumber-maven-plugin:1.4:create (default) @ it-tidalwave-bluemarine2-musicbrainz-datamodel ---
[INFO] ShortRevision tag detected. The value is '12'.
[INFO] Executing: /bin/sh -c cd '/var/jenkins_home/jobs/blueMarine2_Metrics_OpenJDK_17/workspace/modules/MusicBrainzDataModel' && 'git' 'rev-parse' '--verify' '--short=12' 'HEAD'
[INFO] Working directory: /var/jenkins_home/jobs/blueMarine2_Metrics_OpenJDK_17/workspace/modules/MusicBrainzDataModel
[INFO] Storing buildNumber: 5bd725d04573 at timestamp: 1660537065417
[WARNING] Cannot get the branch information from the git repository: 
Detecting the current branch failed: fatal: ref HEAD is not a symbolic ref

[INFO] ShortRevision tag detected. The value is '12'.
[INFO] Executing: /bin/sh -c cd '/var/jenkins_home/jobs/blueMarine2_Metrics_OpenJDK_17/workspace/modules/MusicBrainzDataModel' && 'git' 'rev-parse' '--verify' '--short=12' 'HEAD'
[INFO] Working directory: /var/jenkins_home/jobs/blueMarine2_Metrics_OpenJDK_17/workspace/modules/MusicBrainzDataModel
[INFO] Storing buildScmBranch: UNKNOWN
[INFO] 
[INFO] --- maven-enforcer-plugin:3.0.0-M3:enforce (enforce-maven) @ it-tidalwave-bluemarine2-musicbrainz-datamodel ---
[INFO] 
[INFO] --- maven-enforcer-plugin:3.0.0-M3:enforce (enforce-banned-dependencies) @ it-tidalwave-bluemarine2-musicbrainz-datamodel ---
[INFO] 
[INFO] --- maven-antrun-plugin:3.0.0:run (generate-and-print-build-description) @ it-tidalwave-bluemarine2-musicbrainz-datamodel ---
[INFO] Executing tasks
[INFO]      [echo] DESCRIPTION: origin/master 1.1-ALPHA-2-SNAPSHOT 5bd725d04573
[INFO]      [echo] Java Version: 17.0.1 -source 11 -target 11 -release 11
[INFO] Executed tasks
[INFO] 
[INFO] --- jacoco-maven-plugin:0.8.7:prepare-agent (prepare-agent) @ it-tidalwave-bluemarine2-musicbrainz-datamodel ---
[INFO] Skipping JaCoCo execution because property jacoco.skip is set.
[INFO] 
[INFO] --- jaxb2-maven-plugin:2.5.0:xjc (default) @ it-tidalwave-bluemarine2-musicbrainz-datamodel ---
[INFO] Created EpisodePath [/var/jenkins_home/jobs/blueMarine2_Metrics_OpenJDK_17/workspace/modules/MusicBrainzDataModel/target/generated-sources/jaxb/META-INF/JAXB]: true
[INFO] Ignored given or default xjbSources [/var/jenkins_home/jobs/blueMarine2_Metrics_OpenJDK_17/workspace/modules/MusicBrainzDataModel/src/main/xjb], since it is not an existent file or directory.
[INFO] Created EpisodePath [/var/jenkins_home/jobs/blueMarine2_Metrics_OpenJDK_17/workspace/modules/MusicBrainzDataModel/target/generated-sources/jaxb/META-INF/JAXB]: true
[INFO] 
[INFO] --- maven-resources-plugin:3.2.0:resources (default-resources) @ it-tidalwave-bluemarine2-musicbrainz-datamodel ---
[INFO] Using 'UTF-8' encoding to copy filtered resources.
[INFO] Using 'UTF-8' encoding to copy filtered properties files.
[INFO] skip non existing resourceDirectory /var/jenkins_home/jobs/blueMarine2_Metrics_OpenJDK_17/workspace/modules/MusicBrainzDataModel/src/main/resources
[INFO] Copying 1 resource
[INFO] Copying 1 resource
[INFO] 
[INFO] --- maven-compiler-plugin:3.8.1:compile (default-compile) @ it-tidalwave-bluemarine2-musicbrainz-datamodel ---
[INFO] Changes detected - recompiling the module!
[INFO] Compiling 80 source files to /var/jenkins_home/jobs/blueMarine2_Metrics_OpenJDK_17/workspace/modules/MusicBrainzDataModel/target/classes
[INFO] 
[INFO] --- maven-resources-plugin:3.2.0:testResources (default-testResources) @ it-tidalwave-bluemarine2-musicbrainz-datamodel ---
[INFO] Using 'UTF-8' encoding to copy filtered resources.
[INFO] Using 'UTF-8' encoding to copy filtered properties files.
[INFO] skip non existing resourceDirectory /var/jenkins_home/jobs/blueMarine2_Metrics_OpenJDK_17/workspace/modules/MusicBrainzDataModel/src/test/resources
[INFO] 
[INFO] --- maven-compiler-plugin:3.8.1:testCompile (default-testCompile) @ it-tidalwave-bluemarine2-musicbrainz-datamodel ---
[INFO] No sources to compile
[INFO] 
[INFO] --- maven-surefire-plugin:3.0.0-M5:test (default-test) @ it-tidalwave-bluemarine2-musicbrainz-datamodel ---
[INFO] Tests are skipped.
[INFO] 
[INFO] --- jacoco-maven-plugin:0.8.7:report (report) @ it-tidalwave-bluemarine2-musicbrainz-datamodel ---
[INFO] Skipping JaCoCo execution because property jacoco.skip is set.
[INFO] 
[INFO] --- maven-jar-plugin:3.2.0:jar (default-jar) @ it-tidalwave-bluemarine2-musicbrainz-datamodel ---
[INFO] Building jar: /var/jenkins_home/jobs/blueMarine2_Metrics_OpenJDK_17/workspace/modules/MusicBrainzDataModel/target/it-tidalwave-bluemarine2-musicbrainz-datamodel-1.1-ALPHA-2-SNAPSHOT.5bd725d04573.jar
[INFO] 
[INFO] --- maven-jar-plugin:3.2.0:test-jar (default-test-jar) @ it-tidalwave-bluemarine2-musicbrainz-datamodel ---
[INFO] Skipping packaging of the test-jar
[INFO] 
[INFO] --- maven-install-plugin:3.0.0-M1:install (default-install) @ it-tidalwave-bluemarine2-musicbrainz-datamodel ---
[INFO] Installing /var/jenkins_home/jobs/blueMarine2_Metrics_OpenJDK_17/workspace/modules/MusicBrainzDataModel/target/it-tidalwave-bluemarine2-musicbrainz-datamodel-1.1-ALPHA-2-SNAPSHOT.5bd725d04573.jar to /var/jenkins_home/jobs/blueMarine2_Metrics_OpenJDK_17/workspace@tmp/repository/it/tidalwave/bluemarine2/it-tidalwave-bluemarine2-musicbrainz-datamodel/1.1-ALPHA-2-SNAPSHOT/it-tidalwave-bluemarine2-musicbrainz-datamodel-1.1-ALPHA-2-SNAPSHOT.jar
[INFO] Installing /var/jenkins_home/jobs/blueMarine2_Metrics_OpenJDK_17/workspace/modules/MusicBrainzDataModel/pom.xml to /var/jenkins_home/jobs/blueMarine2_Metrics_OpenJDK_17/workspace@tmp/repository/it/tidalwave/bluemarine2/it-tidalwave-bluemarine2-musicbrainz-datamodel/1.1-ALPHA-2-SNAPSHOT/it-tidalwave-bluemarine2-musicbrainz-datamodel-1.1-ALPHA-2-SNAPSHOT.pom
[INFO] 
[INFO] >>> maven-dependency-plugin:3.1.2:analyze (default-cli) > test-compile @ it-tidalwave-bluemarine2-musicbrainz-datamodel >>>
[INFO] 
[INFO] --- buildnumber-maven-plugin:1.4:create (default) @ it-tidalwave-bluemarine2-musicbrainz-datamodel ---
[INFO] ShortRevision tag detected. The value is '12'.
[INFO] Executing: /bin/sh -c cd '/var/jenkins_home/jobs/blueMarine2_Metrics_OpenJDK_17/workspace/modules/MusicBrainzDataModel' && 'git' 'rev-parse' '--verify' '--short=12' 'HEAD'
[INFO] Working directory: /var/jenkins_home/jobs/blueMarine2_Metrics_OpenJDK_17/workspace/modules/MusicBrainzDataModel
[INFO] Storing buildNumber: 5bd725d04573 at timestamp: 1660537082086
[WARNING] Cannot get the branch information from the git repository: 
Detecting the current branch failed: fatal: ref HEAD is not a symbolic ref

[INFO] ShortRevision tag detected. The value is '12'.
[INFO] Executing: /bin/sh -c cd '/var/jenkins_home/jobs/blueMarine2_Metrics_OpenJDK_17/workspace/modules/MusicBrainzDataModel' && 'git' 'rev-parse' '--verify' '--short=12' 'HEAD'
[INFO] Working directory: /var/jenkins_home/jobs/blueMarine2_Metrics_OpenJDK_17/workspace/modules/MusicBrainzDataModel
[INFO] Storing buildScmBranch: UNKNOWN
[INFO] 
[INFO] --- maven-enforcer-plugin:3.0.0-M3:enforce (enforce-maven) @ it-tidalwave-bluemarine2-musicbrainz-datamodel ---
[INFO] 
[INFO] --- maven-enforcer-plugin:3.0.0-M3:enforce (enforce-banned-dependencies) @ it-tidalwave-bluemarine2-musicbrainz-datamodel ---
[INFO] 
[INFO] --- maven-antrun-plugin:3.0.0:run (generate-and-print-build-description) @ it-tidalwave-bluemarine2-musicbrainz-datamodel ---
[INFO] Executing tasks
[INFO]      [echo] DESCRIPTION: origin/master 1.1-ALPHA-2-SNAPSHOT 5bd725d04573
[INFO]      [echo] Java Version: 17.0.1 -source 11 -target 11 -release 11
[INFO] Executed tasks
[INFO] 
[INFO] --- jacoco-maven-plugin:0.8.7:prepare-agent (prepare-agent) @ it-tidalwave-bluemarine2-musicbrainz-datamodel ---
[INFO] Skipping JaCoCo execution because property jacoco.skip is set.
[INFO] 
[INFO] --- jaxb2-maven-plugin:2.5.0:xjc (default) @ it-tidalwave-bluemarine2-musicbrainz-datamodel ---
[INFO] Ignored given or default xjbSources [/var/jenkins_home/jobs/blueMarine2_Metrics_OpenJDK_17/workspace/modules/MusicBrainzDataModel/src/main/xjb], since it is not an existent file or directory.
[INFO] No changes detected in schema or binding files - skipping JAXB generation.
[INFO] 
[INFO] --- maven-resources-plugin:3.2.0:resources (default-resources) @ it-tidalwave-bluemarine2-musicbrainz-datamodel ---
[INFO] Using 'UTF-8' encoding to copy filtered resources.
[INFO] Using 'UTF-8' encoding to copy filtered properties files.
[INFO] skip non existing resourceDirectory /var/jenkins_home/jobs/blueMarine2_Metrics_OpenJDK_17/workspace/modules/MusicBrainzDataModel/src/main/resources
[INFO] Copying 1 resource
[INFO] Copying 1 resource
[INFO] 
[INFO] --- maven-compiler-plugin:3.8.1:compile (default-compile) @ it-tidalwave-bluemarine2-musicbrainz-datamodel ---
[INFO] Changes detected - recompiling the module!
[INFO] Compiling 80 source files to /var/jenkins_home/jobs/blueMarine2_Metrics_OpenJDK_17/workspace/modules/MusicBrainzDataModel/target/classes
[INFO] 
[INFO] --- maven-resources-plugin:3.2.0:testResources (default-testResources) @ it-tidalwave-bluemarine2-musicbrainz-datamodel ---
[INFO] Using 'UTF-8' encoding to copy filtered resources.
[INFO] Using 'UTF-8' encoding to copy filtered properties files.
[INFO] skip non existing resourceDirectory /var/jenkins_home/jobs/blueMarine2_Metrics_OpenJDK_17/workspace/modules/MusicBrainzDataModel/src/test/resources
[INFO] 
[INFO] --- maven-compiler-plugin:3.8.1:testCompile (default-testCompile) @ it-tidalwave-bluemarine2-musicbrainz-datamodel ---
[INFO] No sources to compile
[WARNING] Failed to getClass for org.apache.maven.plugins.dependency.analyze.AnalyzeMojo
[INFO] 
[INFO] <<< maven-dependency-plugin:3.1.2:analyze (default-cli) < test-compile @ it-tidalwave-bluemarine2-musicbrainz-datamodel <<<
[INFO] 
[INFO] 
[INFO] --- maven-dependency-plugin:3.1.2:analyze (default-cli) @ it-tidalwave-bluemarine2-musicbrainz-datamodel ---
[WARNING] Unused declared dependencies found:
[WARNING]    com.sun.xml.bind:jaxb-impl:jar:3.0.0:runtime
[WARNING]    javax.inject:javax.inject:jar:1:compile
[WARNING]    org.slf4j:slf4j-api:jar:1.7.30:compile
[WARNING]    org.projectlombok:lombok:jar:1.18.22:provided
[WARNING]    org.slf4j:jcl-over-slf4j:jar:1.7.30:runtime
[WARNING]    org.slf4j:jul-to-slf4j:jar:1.7.30:runtime
[WARNING]    ch.qos.logback:logback-classic:jar:1.2.3:runtime
[WARNING]    it.tidalwave.thesefoolishthings:it-tidalwave-util-test:jar:3.2-ALPHA-11:test
[WARNING]    org.testng:testng:jar:6.9.10:test
[WARNING]    org.hamcrest:hamcrest-all:jar:1.3:test
[WARNING]    org.mockito:mockito-core:jar:3.8.0:test
[JENKINS] Archiving disabled
Started calculate disk usage of build
Finished Calculation of disk usage of build in 0 seconds
Started calculate disk usage of workspace
Finished Calculation of disk usage of workspace in 0 seconds
[INFO] 
[INFO] --< it.tidalwave.bluemarine2:it-tidalwave-bluemarine2-metadata-musicbrainz >--
[INFO] Building blueMarine II :: MusicBrainz 1.1-ALPHA-2-SNAPSHOT       [10/26]
[INFO] --------------------------------[ jar ]---------------------------------
[INFO] 
[INFO] --- maven-clean-plugin:3.1.0:clean (default-clean) @ it-tidalwave-bluemarine2-metadata-musicbrainz ---
[INFO] 
[INFO] --- buildnumber-maven-plugin:1.4:create (default) @ it-tidalwave-bluemarine2-metadata-musicbrainz ---
[INFO] ShortRevision tag detected. The value is '12'.
[INFO] Executing: /bin/sh -c cd '/var/jenkins_home/jobs/blueMarine2_Metrics_OpenJDK_17/workspace/modules/MusicBrainz' && 'git' 'rev-parse' '--verify' '--short=12' 'HEAD'
[INFO] Working directory: /var/jenkins_home/jobs/blueMarine2_Metrics_OpenJDK_17/workspace/modules/MusicBrainz
[INFO] Storing buildNumber: 5bd725d04573 at timestamp: 1660537093071
[WARNING] Cannot get the branch information from the git repository: 
Detecting the current branch failed: fatal: ref HEAD is not a symbolic ref

[INFO] ShortRevision tag detected. The value is '12'.
[INFO] Executing: /bin/sh -c cd '/var/jenkins_home/jobs/blueMarine2_Metrics_OpenJDK_17/workspace/modules/MusicBrainz' && 'git' 'rev-parse' '--verify' '--short=12' 'HEAD'
[INFO] Working directory: /var/jenkins_home/jobs/blueMarine2_Metrics_OpenJDK_17/workspace/modules/MusicBrainz
[INFO] Storing buildScmBranch: UNKNOWN
[INFO] 
[INFO] --- maven-enforcer-plugin:3.0.0-M3:enforce (enforce-maven) @ it-tidalwave-bluemarine2-metadata-musicbrainz ---
[INFO] 
[INFO] --- maven-enforcer-plugin:3.0.0-M3:enforce (enforce-banned-dependencies) @ it-tidalwave-bluemarine2-metadata-musicbrainz ---
[INFO] 
[INFO] --- maven-antrun-plugin:3.0.0:run (generate-and-print-build-description) @ it-tidalwave-bluemarine2-metadata-musicbrainz ---
[INFO] Executing tasks
[INFO]      [echo] DESCRIPTION: origin/master 1.1-ALPHA-2-SNAPSHOT 5bd725d04573
[INFO]      [echo] Java Version: 17.0.1 -source 11 -target 11 -release 11
[INFO] Executed tasks
[INFO] 
[INFO] --- jacoco-maven-plugin:0.8.7:prepare-agent (prepare-agent) @ it-tidalwave-bluemarine2-metadata-musicbrainz ---
[INFO] tft.test.jacoco.argLine set to -javaagent:/var/jenkins_home/jobs/blueMarine2_Metrics_OpenJDK_17/workspace@tmp/repository/org/jacoco/org.jacoco.agent/0.8.7/org.jacoco.agent-0.8.7-runtime.jar=destfile=/var/jenkins_home/jobs/blueMarine2_Metrics_OpenJDK_17/workspace/modules/MusicBrainz/target/jacoco.exec
[INFO] 
[INFO] --- maven-resources-plugin:3.2.0:resources (default-resources) @ it-tidalwave-bluemarine2-metadata-musicbrainz ---
[INFO] Using 'UTF-8' encoding to copy filtered resources.
[INFO] Using 'UTF-8' encoding to copy filtered properties files.
[INFO] skip non existing resourceDirectory /var/jenkins_home/jobs/blueMarine2_Metrics_OpenJDK_17/workspace/modules/MusicBrainz/src/main/resources
[INFO] 
[INFO] --- maven-compiler-plugin:3.8.1:compile (default-compile) @ it-tidalwave-bluemarine2-metadata-musicbrainz ---
[INFO] Changes detected - recompiling the module!
[INFO] Compiling 9 source files to /var/jenkins_home/jobs/blueMarine2_Metrics_OpenJDK_17/workspace/modules/MusicBrainz/target/classes
[WARNING] No processor claimed any of these annotations: /javax.annotation.Nullable,/javax.annotation.Nonnegative,/javax.annotation.Nonnull,/javax.annotation.concurrent.Immutable
[INFO] 
[INFO] --- maven-dependency-plugin:3.1.2:unpack (default) @ it-tidalwave-bluemarine2-metadata-musicbrainz ---
[INFO] Configured Artifact: it.tidalwave.bluemarine2.testsets:expected-metadata-iTunes-fg-20160504-2:5:zip
[INFO] Configured Artifact: it.tidalwave.bluemarine2.testsets:expected-metadata-iTunes-fg-20161210-1:2:zip
[INFO] Configured Artifact: it.tidalwave.bluemarine2.testsets:expected-metadata-iTunes-aac-fg-20170131-1:3:zip
[INFO] Configured Artifact: it.tidalwave.bluemarine2.testsets:expected-metadata-amazon-autorip-fg-20170131-1:3:zip
[INFO] Configured Artifact: it.tidalwave.bluemarine2.testsets:musicbrainz-cddb-cache-iTunes-fg-20160504-2:20170123_1415:zip
[INFO] Configured Artifact: it.tidalwave.bluemarine2.testsets:musicbrainz-cddb-cache-iTunes-fg-20161210-1:20170123_1415:zip
[INFO] Configured Artifact: it.tidalwave.bluemarine2.testsets:musicbrainz-cache-iTunes-fg-20160504-2:20170123_1415:zip
[INFO] Configured Artifact: it.tidalwave.bluemarine2.testsets:musicbrainz-cache-iTunes-fg-20161210-1:20170123_1415:zip
[INFO] Configured Artifact: it.tidalwave.bluemarine2.testsets:expected-metadata-musicbrainz-cddb-iTunes-fg-20160504-2:20170123_1415:zip
[INFO] Configured Artifact: it.tidalwave.bluemarine2.testsets:expected-metadata-musicbrainz-cddb-iTunes-fg-20161210-1:20170123_1415:zip
[INFO] Configured Artifact: it.tidalwave.bluemarine2.testsets:expected-metadata-musicbrainz-iTunes-fg-20160504-2:20170126_1435:zip
[INFO] Configured Artifact: it.tidalwave.bluemarine2.testsets:expected-metadata-musicbrainz-iTunes-fg-20161210-1:20210408_2135:zip
[INFO] Unpacking /var/jenkins_home/jobs/blueMarine2_Metrics_OpenJDK_17/workspace@tmp/repository/it/tidalwave/bluemarine2/testsets/expected-metadata-iTunes-fg-20160504-2/5/expected-metadata-iTunes-fg-20160504-2-5.zip to /var/jenkins_home/jobs/blueMarine2_Metrics_OpenJDK_17/workspace/modules/MusicBrainz/target/metadata with includes "" and excludes ""
[INFO] Unpacking /var/jenkins_home/jobs/blueMarine2_Metrics_OpenJDK_17/workspace@tmp/repository/it/tidalwave/bluemarine2/testsets/expected-metadata-iTunes-fg-20161210-1/2/expected-metadata-iTunes-fg-20161210-1-2.zip to /var/jenkins_home/jobs/blueMarine2_Metrics_OpenJDK_17/workspace/modules/MusicBrainz/target/metadata with includes "" and excludes ""
[INFO] Unpacking /var/jenkins_home/jobs/blueMarine2_Metrics_OpenJDK_17/workspace@tmp/repository/it/tidalwave/bluemarine2/testsets/expected-metadata-iTunes-aac-fg-20170131-1/3/expected-metadata-iTunes-aac-fg-20170131-1-3.zip to /var/jenkins_home/jobs/blueMarine2_Metrics_OpenJDK_17/workspace/modules/MusicBrainz/target/metadata with includes "" and excludes ""
[INFO] Unpacking /var/jenkins_home/jobs/blueMarine2_Metrics_OpenJDK_17/workspace@tmp/repository/it/tidalwave/bluemarine2/testsets/expected-metadata-amazon-autorip-fg-20170131-1/3/expected-metadata-amazon-autorip-fg-20170131-1-3.zip to /var/jenkins_home/jobs/blueMarine2_Metrics_OpenJDK_17/workspace/modules/MusicBrainz/target/metadata with includes "" and excludes ""
[INFO] Unpacking /var/jenkins_home/jobs/blueMarine2_Metrics_OpenJDK_17/workspace@tmp/repository/it/tidalwave/bluemarine2/testsets/musicbrainz-cddb-cache-iTunes-fg-20160504-2/20170123_1415/musicbrainz-cddb-cache-iTunes-fg-20160504-2-20170123_1415.zip to /var/jenkins_home/jobs/blueMarine2_Metrics_OpenJDK_17/workspace/modules/MusicBrainz/target/cache/cddb with includes "" and excludes ""
[INFO] Unpacking /var/jenkins_home/jobs/blueMarine2_Metrics_OpenJDK_17/workspace@tmp/repository/it/tidalwave/bluemarine2/testsets/musicbrainz-cddb-cache-iTunes-fg-20161210-1/20170123_1415/musicbrainz-cddb-cache-iTunes-fg-20161210-1-20170123_1415.zip to /var/jenkins_home/jobs/blueMarine2_Metrics_OpenJDK_17/workspace/modules/MusicBrainz/target/cache/cddb with includes "" and excludes ""
[INFO] Unpacking /var/jenkins_home/jobs/blueMarine2_Metrics_OpenJDK_17/workspace@tmp/repository/it/tidalwave/bluemarine2/testsets/musicbrainz-cache-iTunes-fg-20160504-2/20170123_1415/musicbrainz-cache-iTunes-fg-20160504-2-20170123_1415.zip to /var/jenkins_home/jobs/blueMarine2_Metrics_OpenJDK_17/workspace/modules/MusicBrainz/target/cache/musicbrainz with includes "" and excludes ""
[INFO] Unpacking /var/jenkins_home/jobs/blueMarine2_Metrics_OpenJDK_17/workspace@tmp/repository/it/tidalwave/bluemarine2/testsets/musicbrainz-cache-iTunes-fg-20161210-1/20170123_1415/musicbrainz-cache-iTunes-fg-20161210-1-20170123_1415.zip to /var/jenkins_home/jobs/blueMarine2_Metrics_OpenJDK_17/workspace/modules/MusicBrainz/target/cache/musicbrainz with includes "" and excludes ""
[JENKINS] Archiving disabled
Disk usage plugin fails during calculation disk usage of this build.
[JENKINS] Archiving disabled
[JENKINS] Archiving disabled
[JENKINS] Archiving disabled
[JENKINS] Archiving disabled
[JENKINS] Archiving disabled
[JENKINS] Archiving disabled
[JENKINS] Archiving disabled
[JENKINS] Archiving disabled
[JENKINS] Archiving disabled
[JENKINS] Archiving disabled
[JENKINS] Archiving disabled
[JENKINS] Archiving disabled
[JENKINS] Archiving disabled
[JENKINS] Archiving disabled
[JENKINS] Archiving disabled
[JENKINS] Archiving disabled
[JENKINS] Archiving disabled
[JENKINS] Archiving disabled
[JENKINS] Archiving disabled
[JENKINS] Archiving disabled
[JENKINS] Archiving disabled
[INFO] blueMarine II :: Commons ........................... SUCCESS [ 50.760 s]
[INFO] blueMarine II :: Capture One 11 Applescript ........ SUCCESS [ 35.946 s]
[INFO] blueMarine II :: Commons for Tests ................. SUCCESS [ 19.880 s]
[INFO] blueMarine II :: Vocabulary ........................ SUCCESS [ 13.591 s]
[INFO] blueMarine II :: MusicBrainz :: Data Model ......... SUCCESS [ 27.441 s]
[INFO] blueMarine II :: MusicBrainz ....................... FAILURE [ 36.320 s]
[INFO] blueMarine II :: Media Scanner ..................... SKIPPED
[INFO] blueMarine II :: Catalog ........................... SKIPPED
[INFO] blueMarine II :: Downloader ........................ SKIPPED
[INFO] blueMarine II :: UI ................................ SKIPPED
[INFO] blueMarine II :: UI :: JavaFX ...................... SKIPPED
[INFO] blueMarine II :: CEC :: Adapter .................... SKIPPED
[INFO] blueMarine II :: CEC :: Navigation Adapter ......... SKIPPED
[INFO] blueMarine II :: Media Server ...................... SKIPPED
[INFO] blueMarine II :: Media Server :: REST .............. SKIPPED
[INFO] blueMarine II :: Media Server :: UPnP .............. SKIPPED
[INFO] blueMarine II :: Initializer ....................... SKIPPED
[INFO] blueMarine II :: Services (modules) ................ SKIPPED
[INFO] blueMarine II :: Services :: StoppingDown .......... SKIPPED
[INFO] blueMarine II :: Headless Service .................. SKIPPED
[INFO] blueMarine II :: Application :: JavaFX ............. SKIPPED
[INFO] blueMarine II :: Plugins (modules) ................. SKIPPED
[INFO] ------------------------------------------------------------------------
[INFO] BUILD FAILURE
[INFO] ------------------------------------------------------------------------
[INFO] Total time:  07:52 min
[INFO] Finished at: 2022-08-15T04:18:52Z
[INFO] ------------------------------------------------------------------------
[ERROR] Failed to execute goal org.apache.maven.plugins:maven-dependency-plugin:3.1.2:unpack (default) on project it-tidalwave-bluemarine2-metadata-musicbrainz: Error unpacking file: /var/jenkins_home/jobs/blueMarine2_Metrics_OpenJDK_17/workspace@tmp/repository/it/tidalwave/bluemarine2/testsets/musicbrainz-cache-iTunes-fg-20161210-1/20170123_1415/musicbrainz-cache-iTunes-fg-20161210-1-20170123_1415.zip to: /var/jenkins_home/jobs/blueMarine2_Metrics_OpenJDK_17/workspace/modules/MusicBrainz/target/cache/musicbrainz
[ERROR] org.codehaus.plexus.archiver.ArchiverException: Error while expanding /var/jenkins_home/jobs/blueMarine2_Metrics_OpenJDK_17/workspace@tmp/repository/it/tidalwave/bluemarine2/testsets/musicbrainz-cache-iTunes-fg-20161210-1/20170123_1415/musicbrainz-cache-iTunes-fg-20161210-1-20170123_1415.zip: No space left on device
[ERROR] -> [Help 1]
[ERROR] 
[ERROR] To see the full stack trace of the errors, re-run Maven with the -e switch.
[ERROR] Re-run Maven using the -X switch to enable full debug logging.
[ERROR] 
[ERROR] For more information about the errors and possible solutions, please read the following articles:
[ERROR] [Help 1] http://cwiki.apache.org/confluence/display/MAVEN/MojoExecutionException
[ERROR] 
[ERROR] After correcting the problems, you can resume the build with the command
[ERROR]   mvn <goals> -rf :it-tidalwave-bluemarine2-metadata-musicbrainz