Not builtConsole Output

Disk usage plugin fails during calculation disk usage of this build.
[JENKINS] Archiving disabled
[JENKINS] Archiving disabled
[JENKINS] Archiving disabled
[JENKINS] Archiving disabled
[JENKINS] Archiving disabled
[JENKINS] Archiving disabled
[JENKINS] Archiving disabled
[JENKINS] Archiving disabled
[JENKINS] Archiving disabled
[JENKINS] Archiving disabled
[JENKINS] Archiving disabled
[JENKINS] Archiving disabled
[JENKINS] Archiving disabled
[JENKINS] Archiving disabled
[JENKINS] Archiving disabled
[JENKINS] Archiving disabled
[JENKINS] Archiving disabled
[JENKINS] Archiving disabled
[JENKINS] Archiving disabled
[JENKINS] Archiving disabled
[JENKINS] Archiving disabled
[JENKINS] Archiving disabled
[JENKINS] Archiving disabled
[JENKINS] Archiving disabled
[JENKINS] Archiving disabled
[JENKINS] Archiving disabled
[INFO] ------------------------------------------------------------------------
[INFO] Reactor Summary for blueMarine II 1.1-ALPHA-2-SNAPSHOT:
[INFO] 
[INFO] blueMarine II ...................................... SUCCESS [ 12.031 s]
[INFO] blueMarine II (modules) ............................ SUCCESS [  2.188 s]
[INFO] blueMarine II :: Commons ........................... SUCCESS [01:07 min]
[INFO] blueMarine II :: Capture One 11 Applescript ........ SUCCESS [ 46.189 s]
[INFO] blueMarine II :: Commons for Tests ................. SUCCESS [ 23.384 s]
[INFO] blueMarine II :: Model ............................. SUCCESS [03:56 min]
[INFO] blueMarine II :: Persistence ....................... SUCCESS [01:39 min]
[INFO] blueMarine II :: Vocabulary ........................ SUCCESS [ 20.216 s]
[INFO] blueMarine II :: MusicBrainz :: Data Model ......... SUCCESS [ 35.499 s]
[INFO] blueMarine II :: MusicBrainz ....................... FAILURE [ 42.834 s]
[INFO] blueMarine II :: Media Scanner ..................... SKIPPED
[INFO] blueMarine II :: Catalog ........................... SKIPPED
[INFO] blueMarine II :: Downloader ........................ SKIPPED
[INFO] blueMarine II :: UI ................................ SKIPPED
[INFO] blueMarine II :: UI :: JavaFX ...................... SKIPPED
[INFO] blueMarine II :: CEC :: Adapter .................... SKIPPED
[INFO] blueMarine II :: CEC :: Navigation Adapter ......... SKIPPED
[INFO] blueMarine II :: Media Server ...................... SKIPPED
[INFO] blueMarine II :: Media Server :: REST .............. SKIPPED
[INFO] blueMarine II :: Media Server :: UPnP .............. SKIPPED
[INFO] blueMarine II :: Initializer ....................... SKIPPED
[INFO] blueMarine II :: Services (modules) ................ SKIPPED
[INFO] blueMarine II :: Services :: StoppingDown .......... SKIPPED
[INFO] blueMarine II :: Headless Service .................. SKIPPED
[INFO] blueMarine II :: Application :: JavaFX ............. SKIPPED
[INFO] blueMarine II :: Plugins (modules) ................. SKIPPED
[INFO] ------------------------------------------------------------------------
[INFO] BUILD FAILURE
[INFO] ------------------------------------------------------------------------
[INFO] Total time:  10:07 min
[INFO] Finished at: 2022-05-21T04:12:53Z
[INFO] ------------------------------------------------------------------------
[ERROR] Failed to execute goal org.apache.maven.plugins:maven-dependency-plugin:3.1.2:unpack (default) on project it-tidalwave-bluemarine2-metadata-musicbrainz: Error unpacking file: /var/jenkins_home/jobs/blueMarine2_Metrics_OpenJDK_17/workspace@tmp/repository/it/tidalwave/bluemarine2/testsets/musicbrainz-cache-iTunes-fg-20161210-1/20170123_1415/musicbrainz-cache-iTunes-fg-20161210-1-20170123_1415.zip to: /var/jenkins_home/jobs/blueMarine2_Metrics_OpenJDK_17/workspace/modules/MusicBrainz/target/cache/musicbrainz
[ERROR] org.codehaus.plexus.archiver.ArchiverException: Error while expanding /var/jenkins_home/jobs/blueMarine2_Metrics_OpenJDK_17/workspace@tmp/repository/it/tidalwave/bluemarine2/testsets/musicbrainz-cache-iTunes-fg-20161210-1/20170123_1415/musicbrainz-cache-iTunes-fg-20161210-1-20170123_1415.zip: No space left on device
[ERROR] -> [Help 1]
[ERROR] 
[ERROR] To see the full stack trace of the errors, re-run Maven with the -e switch.
[ERROR] Re-run Maven using the -X switch to enable full debug logging.
[ERROR] 
[ERROR] For more information about the errors and possible solutions, please read the following articles:
[ERROR] [Help 1] http://cwiki.apache.org/confluence/display/MAVEN/MojoExecutionException
[ERROR] 
[ERROR] After correcting the problems, you can resume the build with the command
[ERROR]   mvn <goals> -rf :it-tidalwave-bluemarine2-metadata-musicbrainz
Started
Running as SYSTEM
Build failed before it gets to this module
Started calculate disk usage of build
Finished Calculation of disk usage of build in 0 seconds
Started calculate disk usage of workspace
Finished Calculation of disk usage of workspace in 0 seconds
Finished: NOT_BUILT