Not builtConsole Output

Started calculate disk usage of build
Finished Calculation of disk usage of build in 0 seconds
Started calculate disk usage of workspace
Finished Calculation of disk usage of workspace in 0 seconds
[JENKINS] Archiving disabled
[JENKINS] Archiving disabled
[JENKINS] Archiving disabled
[JENKINS] Archiving disabled
[JENKINS] Archiving disabled
[JENKINS] Archiving disabled
[JENKINS] Archiving disabled
[JENKINS] Archiving disabled
[JENKINS] Archiving disabled
[JENKINS] Archiving disabled
[JENKINS] Archiving disabled
[JENKINS] Archiving disabled
[JENKINS] Archiving disabled
[JENKINS] Archiving disabled
[JENKINS] Archiving disabled
[JENKINS] Archiving disabled
[JENKINS] Archiving disabled
[JENKINS] Archiving disabled
[JENKINS] Archiving disabled
[JENKINS] Archiving disabled
[JENKINS] Archiving disabled
[JENKINS] Archiving disabled
[JENKINS] Archiving disabled
[JENKINS] Archiving disabled
[JENKINS] Archiving disabled
[INFO] ------------------------------------------------------------------------
[INFO] Reactor Summary for blueMarine II 1.1-ALPHA-2-SNAPSHOT:
[INFO] 
[INFO] blueMarine II ...................................... SUCCESS [  2.310 s]
[INFO] blueMarine II (modules) ............................ SUCCESS [  0.510 s]
[INFO] blueMarine II :: Commons ........................... SUCCESS [ 13.409 s]
[INFO] blueMarine II :: Capture One 11 Applescript ........ SUCCESS [ 11.309 s]
[INFO] blueMarine II :: Commons for Tests ................. SUCCESS [  5.979 s]
[INFO] blueMarine II :: Model ............................. FAILURE [  9.305 s]
[INFO] blueMarine II :: Persistence ....................... SKIPPED
[INFO] blueMarine II :: Vocabulary ........................ SKIPPED
[INFO] blueMarine II :: MusicBrainz :: Data Model ......... SKIPPED
[INFO] blueMarine II :: MusicBrainz ....................... SKIPPED
[INFO] blueMarine II :: Media Scanner ..................... SKIPPED
[INFO] blueMarine II :: Catalog ........................... SKIPPED
[INFO] blueMarine II :: Downloader ........................ SKIPPED
[INFO] blueMarine II :: UI ................................ SKIPPED
[INFO] blueMarine II :: UI :: JavaFX ...................... SKIPPED
[INFO] blueMarine II :: CEC :: Adapter .................... SKIPPED
[INFO] blueMarine II :: CEC :: Navigation Adapter ......... SKIPPED
[INFO] blueMarine II :: Media Server ...................... SKIPPED
[INFO] blueMarine II :: Media Server :: REST .............. SKIPPED
[INFO] blueMarine II :: Media Server :: UPnP .............. SKIPPED
[INFO] blueMarine II :: Initializer ....................... SKIPPED
[INFO] blueMarine II :: Services (modules) ................ SKIPPED
[INFO] blueMarine II :: Services :: StoppingDown .......... SKIPPED
[INFO] blueMarine II :: Headless Service .................. SKIPPED
[INFO] blueMarine II :: Application :: JavaFX ............. SKIPPED
[INFO] blueMarine II :: Plugins (modules) ................. SKIPPED
[INFO] ------------------------------------------------------------------------
[INFO] BUILD FAILURE
[INFO] ------------------------------------------------------------------------
[INFO] Total time:  50.823 s
[JENKINS] Archiving disabled
[INFO] Finished at: 2021-12-22T08:54:58Z
[INFO] ------------------------------------------------------------------------
[ERROR] Failed to execute goal org.apache.maven.plugins:maven-compiler-plugin:3.8.1:compile (default-compile) on project it-tidalwave-bluemarine2-model: Compilation failure
[ERROR] /var/jenkins_home/jobs/blueMarine2_Build_and_Quick_Test/workspace/modules/Model/src/main/java/it/tidalwave/bluemarine2/model/impl/AudioMetadataFactory.java:[86,48] error: unreported exception CannotReadException; must be caught or declared to be thrown
[ERROR] -> [Help 1]
[ERROR] 
[ERROR] To see the full stack trace of the errors, re-run Maven with the -e switch.
[ERROR] Re-run Maven using the -X switch to enable full debug logging.
[ERROR] 
[ERROR] For more information about the errors and possible solutions, please read the following articles:
[ERROR] [Help 1] http://cwiki.apache.org/confluence/display/MAVEN/MojoFailureException
[ERROR] 
[ERROR] After correcting the problems, you can resume the build with the command
[ERROR]   mvn <goals> -rf :it-tidalwave-bluemarine2-model
Started
Running as SYSTEM
Build failed before it gets to this module
Started calculate disk usage of build
Finished Calculation of disk usage of build in 0 seconds
Started calculate disk usage of workspace
Finished Calculation of disk usage of workspace in 0 seconds
Finished: NOT_BUILT