FailedConsole Output

Started by an SCM change
Running as SYSTEM
Building in workspace /var/jenkins_home/jobs/blueMarine2_Build_and_Quick_Test/workspace
The recommended git tool is: NONE
No credentials specified
 > git rev-parse --is-inside-work-tree # timeout=10
Fetching changes from the remote Git repository
 > git config remote.origin.url https://bitbucket.org/tidalwave/bluemarine2-src.git # timeout=10
Cleaning workspace
 > git rev-parse --verify HEAD # timeout=10
Resetting working tree
 > git reset --hard # timeout=10
 > git clean -fdx # timeout=10
Fetching upstream changes from https://bitbucket.org/tidalwave/bluemarine2-src.git
 > git --version # timeout=10
 > git --version # 'git version 2.20.1'
 > git fetch --tags --force --progress -- https://bitbucket.org/tidalwave/bluemarine2-src.git +refs/heads/*:refs/remotes/origin/* # timeout=10
Seen branch in repository origin/dlnaheaders
Seen branch in repository origin/fabrizio.giudici
Seen branch in repository origin/fix-for-BMT-129
Seen branch in repository origin/fix-for-BMT-143
Seen branch in repository origin/fix-for-BMT-154
Seen branch in repository origin/fix-for-BMT-172
Seen branch in repository origin/fix-for-BMT-26
Seen branch in repository origin/fix-for-BMT-59
Seen branch in repository origin/master
Seen 9 remote branches
 > git show-ref --tags -d # timeout=10
Checking out Revision 696c34a461e1bb7986bc74a6361cf2ae9a147509 (origin/fabrizio.giudici)
 > git config core.sparsecheckout # timeout=10
 > git checkout -f 696c34a461e1bb7986bc74a6361cf2ae9a147509 # timeout=10
Commit message: "Fixed repo URL with https."
 > git rev-list --no-walk d6bf90e03992038f9a90486e5fd1f21a1a4a4b6e # timeout=10
Parsing POMs
using settings config with name settings-mirror
Replacing all maven server entries not found in credentials list is true
Modules changed, recalculating dependency graph
Established TCP socket on 43639
[workspace] $ /var/jenkins_home/tools/hudson.model.JDK/AdoptOpenJDK_11.0.10_9/bin/java -DblueMarine2.musicTestSets.path=/mnt/test-data/MusicTestSets -cp /var/jenkins_home/plugins/maven-plugin/WEB-INF/lib/maven35-agent-1.13.jar:/var/jenkins_home/tools/hudson.tasks.Maven_MavenInstallation/Maven_3.6.3/boot/plexus-classworlds-2.6.0.jar:/var/jenkins_home/tools/hudson.tasks.Maven_MavenInstallation/Maven_3.6.3/conf/logging jenkins.maven3.agent.Maven35Main /var/jenkins_home/tools/hudson.tasks.Maven_MavenInstallation/Maven_3.6.3 /var/jenkins_home/war/WEB-INF/lib/remoting-4.5.jar /var/jenkins_home/plugins/maven-plugin/WEB-INF/lib/maven35-interceptor-1.13.jar /var/jenkins_home/plugins/maven-plugin/WEB-INF/lib/maven3-interceptor-commons-1.13.jar 43639
<===[JENKINS REMOTING CAPACITY]===>channel started
using settings config with name settings-mirror
Replacing all maven server entries not found in credentials list is true
Executing Maven:  -B -f /var/jenkins_home/jobs/blueMarine2_Build_and_Quick_Test/workspace/pom.xml -Dmaven.repo.local=/var/jenkins_home/maven-repositories/2 -s /tmp/settings765245575935428802.xml -Pgenerate-revision-id,it.tidalwave-ci-v1 -DtestFailureIgnore=true -Dit.tidalwave-ci.skipLongTests=true
[INFO] Scanning for projects...
[INFO] ------------------------------------------------------------------------
[INFO] Reactor Build Order:
[INFO] 
[INFO] blueMarine II                                                      [pom]
[INFO] blueMarine II (modules)                                            [pom]
[INFO] blueMarine II :: Commons                                           [jar]
[INFO] blueMarine II :: Capture One 11 Applescript                        [jar]
[INFO] blueMarine II :: Commons for Tests                                 [jar]
[INFO] blueMarine II :: Model                                             [jar]
[INFO] blueMarine II :: Persistence                                       [jar]
[INFO] blueMarine II :: Vocabulary                                        [jar]
[INFO] blueMarine II :: MusicBrainz :: Data Model                         [jar]
[INFO] blueMarine II :: MusicBrainz                                       [jar]
[INFO] blueMarine II :: Media Scanner                                     [jar]
[INFO] blueMarine II :: Catalog                                           [jar]
[INFO] blueMarine II :: Downloader                                        [jar]
[INFO] blueMarine II :: UI                                                [jar]
[INFO] blueMarine II :: UI :: JavaFX                                      [jar]
[INFO] blueMarine II :: CEC :: Adapter                                    [jar]
[INFO] blueMarine II :: CEC :: Navigation Adapter                         [jar]
[INFO] blueMarine II :: Media Server                                      [jar]
[INFO] blueMarine II :: Media Server :: REST                              [jar]
[INFO] blueMarine II :: Media Server :: UPnP                              [jar]
[INFO] blueMarine II :: Initializer                                       [jar]
[INFO] blueMarine II :: Services (modules)                                [pom]
[INFO] blueMarine II :: Services :: StoppingDown                          [jar]
[INFO] blueMarine II :: Headless Service                                  [jar]
[INFO] blueMarine II :: Application :: JavaFX                             [jar]
[INFO] blueMarine II :: Plugins (modules)                                 [pom]
[INFO] 
[INFO] ----------------< it.tidalwave.bluemarine2:bluemarine2 >----------------
[INFO] Building blueMarine II 1.1-ALPHA-2-SNAPSHOT                       [1/26]
[INFO] --------------------------------[ pom ]---------------------------------
[INFO] 
[INFO] --- maven-clean-plugin:3.1.0:clean (default-clean) @ bluemarine2 ---
[INFO] 
[INFO] --- buildnumber-maven-plugin:1.4:create (default) @ bluemarine2 ---
[INFO] ShortRevision tag detected. The value is '12'.
[INFO] Executing: /bin/sh -c cd '/var/jenkins_home/jobs/blueMarine2_Build_and_Quick_Test/workspace' && 'git' 'rev-parse' '--verify' '--short=12' 'HEAD'
[INFO] Working directory: /var/jenkins_home/jobs/blueMarine2_Build_and_Quick_Test/workspace
[INFO] Storing buildNumber: 696c34a461e1 at timestamp: 1640163249865
[WARNING] Cannot get the branch information from the git repository: 
Detecting the current branch failed: fatal: ref HEAD is not a symbolic ref

[INFO] ShortRevision tag detected. The value is '12'.
[INFO] Executing: /bin/sh -c cd '/var/jenkins_home/jobs/blueMarine2_Build_and_Quick_Test/workspace' && 'git' 'rev-parse' '--verify' '--short=12' 'HEAD'
[INFO] Working directory: /var/jenkins_home/jobs/blueMarine2_Build_and_Quick_Test/workspace
[INFO] Storing buildScmBranch: UNKNOWN
[INFO] 
[INFO] --- maven-enforcer-plugin:3.0.0-M3:enforce (enforce-maven) @ bluemarine2 ---
[INFO] 
[INFO] --- maven-enforcer-plugin:3.0.0-M3:enforce (enforce-banned-dependencies) @ bluemarine2 ---
[INFO] 
[INFO] --- maven-antrun-plugin:3.0.0:run (generate-and-print-build-description) @ bluemarine2 ---
[INFO] Executing tasks
[INFO]      [echo] DESCRIPTION: origin/fabrizio.giudici 1.1-ALPHA-2-SNAPSHOT 696c34a461e1
[INFO]      [echo] Java Version: 11.0.10 -source 1.8 -target 1.8 -release 
[INFO] Executed tasks
[INFO] 
[INFO] --- maven-jar-plugin:3.2.0:test-jar (default-test-jar) @ bluemarine2 ---
[INFO] Skipping packaging of the test-jar
[INFO] 
[INFO] --- maven-install-plugin:3.0.0-M1:install (default-install) @ bluemarine2 ---
[INFO] Installing /var/jenkins_home/jobs/blueMarine2_Build_and_Quick_Test/workspace/pom.xml to /var/jenkins_home/maven-repositories/2/it/tidalwave/bluemarine2/bluemarine2/1.1-ALPHA-2-SNAPSHOT/bluemarine2-1.1-ALPHA-2-SNAPSHOT.pom
[JENKINS] Archiving disabled
Started calculate disk usage of build
Finished Calculation of disk usage of build in 0 seconds
Started calculate disk usage of workspace
Finished Calculation of disk usage of workspace in 0 seconds
[INFO] 
[INFO] ------------< it.tidalwave.bluemarine2:bluemarine2-modules >------------
[INFO] Building blueMarine II (modules) 1.1-ALPHA-2-SNAPSHOT             [2/26]
[INFO] --------------------------------[ pom ]---------------------------------
[INFO] 
[INFO] --- maven-clean-plugin:3.1.0:clean (default-clean) @ bluemarine2-modules ---
[INFO] 
[INFO] --- buildnumber-maven-plugin:1.4:create (default) @ bluemarine2-modules ---
[INFO] ShortRevision tag detected. The value is '12'.
[INFO] Executing: /bin/sh -c cd '/var/jenkins_home/jobs/blueMarine2_Build_and_Quick_Test/workspace/modules' && 'git' 'rev-parse' '--verify' '--short=12' 'HEAD'
[INFO] Working directory: /var/jenkins_home/jobs/blueMarine2_Build_and_Quick_Test/workspace/modules
[INFO] Storing buildNumber: 696c34a461e1 at timestamp: 1640163252555
[WARNING] Cannot get the branch information from the git repository: 
Detecting the current branch failed: fatal: ref HEAD is not a symbolic ref

[INFO] ShortRevision tag detected. The value is '12'.
[INFO] Executing: /bin/sh -c cd '/var/jenkins_home/jobs/blueMarine2_Build_and_Quick_Test/workspace/modules' && 'git' 'rev-parse' '--verify' '--short=12' 'HEAD'
[INFO] Working directory: /var/jenkins_home/jobs/blueMarine2_Build_and_Quick_Test/workspace/modules
[INFO] Storing buildScmBranch: UNKNOWN
[INFO] 
[INFO] --- maven-enforcer-plugin:3.0.0-M3:enforce (enforce-maven) @ bluemarine2-modules ---
[INFO] 
[INFO] --- maven-enforcer-plugin:3.0.0-M3:enforce (enforce-banned-dependencies) @ bluemarine2-modules ---
[INFO] 
[INFO] --- maven-antrun-plugin:3.0.0:run (generate-and-print-build-description) @ bluemarine2-modules ---
[INFO] Executing tasks
[INFO]      [echo] DESCRIPTION: origin/fabrizio.giudici 1.1-ALPHA-2-SNAPSHOT 696c34a461e1
[INFO]      [echo] Java Version: 11.0.10 -source 11 -target 11 -release 11
[INFO] Executed tasks
[INFO] 
[INFO] --- maven-jar-plugin:3.2.0:test-jar (default-test-jar) @ bluemarine2-modules ---
[INFO] Skipping packaging of the test-jar
[INFO] 
[INFO] --- maven-install-plugin:3.0.0-M1:install (default-install) @ bluemarine2-modules ---
[INFO] Installing /var/jenkins_home/jobs/blueMarine2_Build_and_Quick_Test/workspace/modules/pom.xml to /var/jenkins_home/maven-repositories/2/it/tidalwave/bluemarine2/bluemarine2-modules/1.1-ALPHA-2-SNAPSHOT/bluemarine2-modules-1.1-ALPHA-2-SNAPSHOT.pom
[JENKINS] Archiving disabled
Started calculate disk usage of build
Finished Calculation of disk usage of build in 0 seconds
Started calculate disk usage of workspace
Finished Calculation of disk usage of workspace in 0 seconds
[INFO] 
[INFO] -----< it.tidalwave.bluemarine2:it-tidalwave-bluemarine2-commons >------
[INFO] Building blueMarine II :: Commons 1.1-ALPHA-2-SNAPSHOT            [3/26]
[INFO] --------------------------------[ jar ]---------------------------------
[INFO] 
[INFO] --- maven-clean-plugin:3.1.0:clean (default-clean) @ it-tidalwave-bluemarine2-commons ---
[INFO] 
[INFO] --- buildnumber-maven-plugin:1.4:create (default) @ it-tidalwave-bluemarine2-commons ---
[INFO] ShortRevision tag detected. The value is '12'.
[INFO] Executing: /bin/sh -c cd '/var/jenkins_home/jobs/blueMarine2_Build_and_Quick_Test/workspace/modules/Commons' && 'git' 'rev-parse' '--verify' '--short=12' 'HEAD'
[INFO] Working directory: /var/jenkins_home/jobs/blueMarine2_Build_and_Quick_Test/workspace/modules/Commons
[INFO] Storing buildNumber: 696c34a461e1 at timestamp: 1640163254155
[WARNING] Cannot get the branch information from the git repository: 
Detecting the current branch failed: fatal: ref HEAD is not a symbolic ref

[INFO] ShortRevision tag detected. The value is '12'.
[INFO] Executing: /bin/sh -c cd '/var/jenkins_home/jobs/blueMarine2_Build_and_Quick_Test/workspace/modules/Commons' && 'git' 'rev-parse' '--verify' '--short=12' 'HEAD'
[INFO] Working directory: /var/jenkins_home/jobs/blueMarine2_Build_and_Quick_Test/workspace/modules/Commons
[INFO] Storing buildScmBranch: UNKNOWN
[INFO] 
[INFO] --- maven-enforcer-plugin:3.0.0-M3:enforce (enforce-maven) @ it-tidalwave-bluemarine2-commons ---
[INFO] 
[INFO] --- maven-enforcer-plugin:3.0.0-M3:enforce (enforce-banned-dependencies) @ it-tidalwave-bluemarine2-commons ---
[INFO] 
[INFO] --- maven-antrun-plugin:3.0.0:run (generate-and-print-build-description) @ it-tidalwave-bluemarine2-commons ---
[INFO] Executing tasks
[INFO]      [echo] DESCRIPTION: origin/fabrizio.giudici 1.1-ALPHA-2-SNAPSHOT 696c34a461e1
[INFO]      [echo] Java Version: 11.0.10 -source 11 -target 11 -release 11
[INFO] Executed tasks
[INFO] 
[INFO] --- maven-resources-plugin:3.2.0:resources (default-resources) @ it-tidalwave-bluemarine2-commons ---
[INFO] Using 'UTF-8' encoding to copy filtered resources.
[INFO] Using 'UTF-8' encoding to copy filtered properties files.
[INFO] Copying 2 resources
[INFO] 
[INFO] --- maven-compiler-plugin:3.8.1:compile (default-compile) @ it-tidalwave-bluemarine2-commons ---
[INFO] Changes detected - recompiling the module!
[INFO] Compiling 21 source files to /var/jenkins_home/jobs/blueMarine2_Build_and_Quick_Test/workspace/modules/Commons/target/classes
[WARNING] No processor claimed any of these annotations: /javax.annotation.Nullable,/javax.annotation.Nonnegative,/javax.annotation.concurrent.ThreadSafe,/javax.annotation.concurrent.NotThreadSafe,/javax.annotation.Nonnull,/it.tidalwave.util.annotation.VisibleForTesting,java.base/java.lang.FunctionalInterface,/javax.annotation.concurrent.Immutable,/javax.annotation.PostConstruct,java.base/java.lang.Override
[WARNING] /var/jenkins_home/jobs/blueMarine2_Build_and_Quick_Test/workspace/modules/Commons/src/main/java/it/tidalwave/util/SupplierBasedFinder.java:[60,55] [unchecked] unchecked conversion
  required: SupplierBasedFinder<T>
  found:    SupplierBasedFinder
  where T is a type-variable:
    T extends Object declared in class SupplierBasedFinder
[WARNING] /var/jenkins_home/jobs/blueMarine2_Build_and_Quick_Test/workspace/modules/Commons/src/main/java/it/tidalwave/util/MappingFinder.java:[56,41] [rawtypes] found raw type: MappingFinder
  missing type arguments for generic class MappingFinder<TYPE>
  where TYPE is a type-variable:
    TYPE extends Object declared in class MappingFinder
[WARNING] /var/jenkins_home/jobs/blueMarine2_Build_and_Quick_Test/workspace/modules/Commons/src/main/java/it/tidalwave/util/MappingFinder.java:[58,13] [unchecked] unchecked method invocation: constructor <init> in class SupplierBasedFinder is applied to given types
  required: SupplierBasedFinder<T>,Object
  found: MappingFinder,Object
  where T is a type-variable:
    T extends Object declared in class SupplierBasedFinder
[WARNING] /var/jenkins_home/jobs/blueMarine2_Build_and_Quick_Test/workspace/modules/Commons/src/main/java/it/tidalwave/util/MappingFinder.java:[58,14] [unchecked] unchecked conversion
  required: SupplierBasedFinder<T>
  found:    MappingFinder
  where T is a type-variable:
    T extends Object declared in class SupplierBasedFinder
[WARNING] /var/jenkins_home/jobs/blueMarine2_Build_and_Quick_Test/workspace/modules/Commons/src/main/java/it/tidalwave/util/MappingFinder.java:[59,52] [unchecked] unchecked conversion
  required: MappingFinder<TYPE>
  found:    MappingFinder
  where TYPE is a type-variable:
    TYPE extends Object declared in class MappingFinder
[INFO] 
[INFO] --- maven-resources-plugin:3.2.0:testResources (default-testResources) @ it-tidalwave-bluemarine2-commons ---
[INFO] Using 'UTF-8' encoding to copy filtered resources.
[INFO] Using 'UTF-8' encoding to copy filtered properties files.
[INFO] Copying 2 resources
[INFO] 
[INFO] --- maven-compiler-plugin:3.8.1:testCompile (default-testCompile) @ it-tidalwave-bluemarine2-commons ---
[INFO] Changes detected - recompiling the module!
[INFO] Compiling 1 source file to /var/jenkins_home/jobs/blueMarine2_Build_and_Quick_Test/workspace/modules/Commons/target/test-classes
[WARNING] No processor claimed any of these annotations: /org.testng.annotations.Test,/javax.annotation.Nonnull,/org.testng.annotations.BeforeTest
[INFO] 
[INFO] --- maven-surefire-plugin:3.0.0-M5:test (default-test) @ it-tidalwave-bluemarine2-commons ---
[INFO] 
[INFO] -------------------------------------------------------
[INFO]  T E S T S
[INFO] -------------------------------------------------------
[INFO] Running it.tidalwave.bluemarine2.util.PathNormalizationTest
09:54:24.604 [main                ] INFO  i.tidalwave.bluemarine2.util.PathNormalizationTest - STARTING TESTS OF it.tidalwave.bluemarine2.util.PathNormalizationTest
09:54:24.641 [main                ] INFO  i.tidalwave.bluemarine2.util.PathNormalizationTest - ************************
09:54:24.641 [main                ] INFO  i.tidalwave.bluemarine2.util.PathNormalizationTest - TEST "test precondition"
09:54:24.641 [main                ] INFO  i.tidalwave.bluemarine2.util.PathNormalizationTest - ************************
09:54:24.649 [main                ] INFO  i.tidalwave.bluemarine2.util.PathNormalizationTest - NFC: 004c 0027 0041 0067 0061 0063 0327 0061 006e 0074 0065
09:54:24.650 [main                ] INFO  i.tidalwave.bluemarine2.util.PathNormalizationTest - NFD: 004c 0027 0041 0067 0061 00e7 0061 006e 0074 0065
09:54:24.655 [main                ] INFO  i.tidalwave.bluemarine2.util.PathNormalizationTest - TEST PASSED in 15 msec
09:54:24.656 [main                ] INFO  i.tidalwave.bluemarine2.util.PathNormalizationTest - 
09:54:24.657 [main                ] INFO  i.tidalwave.bluemarine2.util.PathNormalizationTest - **********************************
09:54:24.658 [main                ] INFO  i.tidalwave.bluemarine2.util.PathNormalizationTest - TEST "test normalizedToNativeForm"
09:54:24.658 [main                ] INFO  i.tidalwave.bluemarine2.util.PathNormalizationTest - **********************************
09:54:24.659 [main                ] INFO  it.tidalwave.bluemarine2.util.PathNormalization    - Charset normalizer form: NFC
09:54:24.672 [main                ] INFO  i.tidalwave.bluemarine2.util.PathNormalizationTest - TEST PASSED in 15 msec
09:54:24.672 [main                ] INFO  i.tidalwave.bluemarine2.util.PathNormalizationTest - 
09:54:24.673 [main                ] INFO  i.tidalwave.bluemarine2.util.PathNormalizationTest - ****************************
09:54:24.673 [main                ] INFO  i.tidalwave.bluemarine2.util.PathNormalizationTest - TEST "test equalsNormalized"
09:54:24.673 [main                ] INFO  i.tidalwave.bluemarine2.util.PathNormalizationTest - ****************************
09:54:24.673 [main                ] INFO  i.tidalwave.bluemarine2.util.PathNormalizationTest - TEST PASSED in 0 msec
09:54:24.674 [main                ] INFO  i.tidalwave.bluemarine2.util.PathNormalizationTest - 
09:54:24.674 [main                ] INFO  i.tidalwave.bluemarine2.util.PathNormalizationTest - ***********************************
09:54:24.674 [main                ] INFO  i.tidalwave.bluemarine2.util.PathNormalizationTest - TEST "test file creation from Java"
09:54:24.674 [main                ] INFO  i.tidalwave.bluemarine2.util.PathNormalizationTest - ***********************************
09:54:24.678 [main                ] INFO  i.tidalwave.bluemarine2.util.PathNormalizationTest - On Linux two files are created, with both normalizations.
09:54:24.678 [main                ] INFO  i.tidalwave.bluemarine2.util.PathNormalizationTest - Child: L'Agaçante
09:54:24.680 [main                ] INFO  i.tidalwave.bluemarine2.util.PathNormalizationTest - NFC:   004c 0027 0041 0067 0061 0063 0327 0061 006e 0074 0065
09:54:24.681 [main                ] INFO  i.tidalwave.bluemarine2.util.PathNormalizationTest - NFD:   004c 0027 0041 0067 0061 00e7 0061 006e 0074 0065
09:54:24.681 [main                ] INFO  i.tidalwave.bluemarine2.util.PathNormalizationTest - Child: 004c 0027 0041 0067 0061 0063 0327 0061 006e 0074 0065
09:54:24.682 [main                ] INFO  i.tidalwave.bluemarine2.util.PathNormalizationTest - Child: L'Agaçante
09:54:24.682 [main                ] INFO  i.tidalwave.bluemarine2.util.PathNormalizationTest - NFC:   004c 0027 0041 0067 0061 0063 0327 0061 006e 0074 0065
09:54:24.683 [main                ] INFO  i.tidalwave.bluemarine2.util.PathNormalizationTest - NFD:   004c 0027 0041 0067 0061 00e7 0061 006e 0074 0065
09:54:24.683 [main                ] INFO  i.tidalwave.bluemarine2.util.PathNormalizationTest - Child: 004c 0027 0041 0067 0061 00e7 0061 006e 0074 0065
09:54:24.683 [main                ] INFO  i.tidalwave.bluemarine2.util.PathNormalizationTest - TEST PASSED in 9 msec
09:54:24.684 [main                ] INFO  i.tidalwave.bluemarine2.util.PathNormalizationTest - 
09:54:24.684 [main                ] INFO  i.tidalwave.bluemarine2.util.PathNormalizationTest - *******************************
09:54:24.684 [main                ] INFO  i.tidalwave.bluemarine2.util.PathNormalizationTest - TEST "test extraction from zip"
09:54:24.685 [main                ] INFO  i.tidalwave.bluemarine2.util.PathNormalizationTest - *******************************
09:54:24.685 [main                ] INFO  i.tidalwave.bluemarine2.util.PathNormalizationTest - Extracting files from zip...
09:54:24.709 [main                ] INFO  it.tidalwave.util.spi.DefaultProcessExecutor       - >>>> executing [/usr/bin/unzip, -o, src/test/resources/agacantes.zip, -d, target/zip] ...
09:54:24.725 [main                ] INFO  it.tidalwave.util.spi.DefaultProcessExecutor       - >>>> environment: [PATH=/var/jenkins_home/tools/hudson.tasks.Maven_MavenInstallation/Maven_3.6.3/bin:/var/jenkins_home/tools/hudson.model.JDK/AdoptOpenJDK_11.0.10_9/bin:/var/jenkins_home/tools/hudson.model.JDK/AdoptOpenJDK_11.0.10_9/bin:/opt/java/openjdk/bin:/usr/local/sbin:/usr/local/bin:/usr/sbin:/usr/bin:/sbin:/bin, COPY_REFERENCE_FILE_LOG=/var/jenkins_home/copy_reference_file.log, RUN_DISPLAY_URL=https://services.tidalwave.it/ci/job/blueMarine2_Build_and_Quick_Test/158/display/redirect, HUDSON_HOME=/var/jenkins_home, RUN_CHANGES_DISPLAY_URL=https://services.tidalwave.it/ci/job/blueMarine2_Build_and_Quick_Test/158/display/redirect?page=changes, JOB_URL=https://services.tidalwave.it/ci/job/blueMarine2_Build_and_Quick_Test/, HUDSON_COOKIE=28307a03-4c82-42ba-948e-ed7357718aac, MAVEN_HOME=/var/jenkins_home/tools/hudson.tasks.Maven_MavenInstallation/Maven_3.6.3, JENKINS_SERVER_COOKIE=b348d8d307011da7, PWD=/var/jenkins_home/jobs/blueMarine2_Build_and_Quick_Test/workspace/modules/Commons, RUN_TESTS_DISPLAY_URL=https://services.tidalwave.it/ci/job/blueMarine2_Build_and_Quick_Test/158/display/redirect?page=tests, JENKINS_URL=https://services.tidalwave.it/ci/, KUBERNETES_PORT_443_TCP=tcp://10.96.0.1:443, POM_VERSION=1.1-ALPHA-2-SNAPSHOT, LANGUAGE=en_US:en, BUILD_TAG=jenkins-blueMarine2_Build_and_Quick_Test-158, JENKINS_SERVICE_HOST=10.98.6.166, POM_GROUPID=it.tidalwave.bluemarine2, JENKINS_PORT_8080_TCP=tcp://10.98.6.166:8080, OLDPWD=/var/jenkins_home/jobs/blueMarine2_Build_and_Quick_Test/workspace/modules/Commons, JENKINS_HOME=/var/jenkins_home, NODE_NAME=master, BUILD_DISPLAY_NAME=#158, LC_ALL=en_US.UTF-8, M2_HOME=/var/jenkins_home/tools/hudson.tasks.Maven_MavenInstallation/Maven_3.6.3, JOB_DISPLAY_URL=https://services.tidalwave.it/ci/job/blueMarine2_Build_and_Quick_Test/display/redirect, GIT_BRANCH=origin/fabrizio.giudici, JENKINS_PORT_8080_TCP_PORT=8080, KUBERNETES_SERVICE_PORT_HTTPS=443, SHLVL=0, WORKSPACE_TMP=/var/jenkins_home/jobs/blueMarine2_Build_and_Quick_Test/workspace@tmp, GIT_PREVIOUS_COMMIT=d6bf90e03992038f9a90486e5fd1f21a1a4a4b6e, POM_PACKAGING=pom, JENKINS_PORT=tcp://10.98.6.166:8080, KUBERNETES_PORT=tcp://10.96.0.1:443, JAVA_HOME=/var/jenkins_home/tools/hudson.model.JDK/AdoptOpenJDK_11.0.10_9, BUILD_ID=158, JENKINS_VERSION=2.263.4, KUBERNETES_SERVICE_HOST=10.96.0.1, LANG=en_US.UTF-8, JOB_NAME=blueMarine2_Build_and_Quick_Test, JENKINS_SERVICE_PORT=8080, MAVEN_OPTS=-DblueMarine2.musicTestSets.path=/mnt/test-data/MusicTestSets, JENKINS_PORT_8080_TCP_PROTO=tcp, JENKINS_PORT_8080_TCP_ADDR=10.98.6.166, POM_ARTIFACTID=bluemarine2, GIT_PREVIOUS_SUCCESSFUL_COMMIT=d6bf90e03992038f9a90486e5fd1f21a1a4a4b6e, NODE_LABELS=master, HUDSON_URL=https://services.tidalwave.it/ci/, WORKSPACE=/var/jenkins_home/jobs/blueMarine2_Build_and_Quick_Test/workspace, JENKINS_SLAVE_AGENT_PORT=50000, JAVA_VERSION=jdk8u282-b08, JENKINS_OPTS=--prefix=/ci, GIT_COMMIT=696c34a461e1bb7986bc74a6361cf2ae9a147509, KUBERNETES_PORT_443_TCP_ADDR=10.96.0.1, EXECUTOR_NUMBER=2, HUDSON_SERVER_COOKIE=b348d8d307011da7, JENKINS_UC=https://updates.jenkins.io, KUBERNETES_PORT_443_TCP_PROTO=tcp, JOB_BASE_NAME=blueMarine2_Build_and_Quick_Test, JENKINS_INCREMENTALS_REPO_MIRROR=https://repo.jenkins-ci.org/incrementals, KUBERNETES_SERVICE_PORT=443, REF=/usr/share/jenkins/ref, BUILD_NUMBER=158, BUILD_URL=https://services.tidalwave.it/ci/job/blueMarine2_Build_and_Quick_Test/158/, HOSTNAME=jenkins-64b9869db8-8pn4l, RUN_ARTIFACTS_DISPLAY_URL=https://services.tidalwave.it/ci/job/blueMarine2_Build_and_Quick_Test/158/display/redirect?page=artifacts, POM_DISPLAYNAME=blueMarine II, GIT_URL=https://bitbucket.org/tidalwave/bluemarine2-src.git, KUBERNETES_PORT_443_TCP_PORT=443, JENKINS_UC_EXPERIMENTAL=https://updates.jenkins.io/experimental, HOME=/var/jenkins_home]
09:54:24.756 [main                ] INFO  it.tidalwave.util.spi.DefaultProcessExecutor       - out - started
09:54:24.764 [main                ] INFO  it.tidalwave.util.spi.DefaultProcessExecutor       - err - started
09:54:24.769 [main                ] INFO  i.tidalwave.bluemarine2.util.PathNormalizationTest - On Linux two files are extracted, with both normalizations.
09:54:24.794 [main                ] INFO  i.tidalwave.bluemarine2.util.PathNormalizationTest - NFC:           004c 0027 0041 0067 0061 0063 0327 0061 006e 0074 0065
09:54:24.794 [main                ] INFO  i.tidalwave.bluemarine2.util.PathNormalizationTest - NFD:           004c 0027 0041 0067 0061 00e7 0061 006e 0074 0065
09:54:24.795 [main                ] INFO  i.tidalwave.bluemarine2.util.PathNormalizationTest - Extracted NFC: 004c 0027 0041 0067 0061 0063 0327 0061 006e 0074 0065
09:54:24.795 [main                ] INFO  i.tidalwave.bluemarine2.util.PathNormalizationTest - Extracted NFD: 004c 0027 0041 0067 0061 00e7 0061 006e 0074 0065
09:54:24.795 [main                ] INFO  i.tidalwave.bluemarine2.util.PathNormalizationTest - TEST PASSED in 111 msec
09:54:24.795 [main                ] INFO  i.tidalwave.bluemarine2.util.PathNormalizationTest - 
09:54:24.796 [main                ] INFO  i.tidalwave.bluemarine2.util.PathNormalizationTest - *******************************
09:54:24.796 [main                ] INFO  i.tidalwave.bluemarine2.util.PathNormalizationTest - TEST "test extraction from tar"
09:54:24.796 [main                ] INFO  i.tidalwave.bluemarine2.util.PathNormalizationTest - *******************************
09:54:24.796 [main                ] INFO  i.tidalwave.bluemarine2.util.PathNormalizationTest - Extracting files from tar...
09:54:24.794 [pool-2-thread-3     ] DEBUG it.tidalwave.util.spi.DefaultProcessExecutor       - >>>>>> err closed
09:54:24.806 [main                ] INFO  it.tidalwave.util.spi.DefaultProcessExecutor       - >>>> executing [/bin/tar, -xvf, src/test/resources/agacantes.tar.gz, -C, target/tar] ...
09:54:24.794 [pool-2-thread-1     ] TRACE it.tidalwave.util.spi.DefaultProcessExecutor       - >>>>>>>> out Archive:  src/test/resources/agacantes.zip
09:54:24.810 [main                ] INFO  it.tidalwave.util.spi.DefaultProcessExecutor       - >>>> environment: [PATH=/var/jenkins_home/tools/hudson.tasks.Maven_MavenInstallation/Maven_3.6.3/bin:/var/jenkins_home/tools/hudson.model.JDK/AdoptOpenJDK_11.0.10_9/bin:/var/jenkins_home/tools/hudson.model.JDK/AdoptOpenJDK_11.0.10_9/bin:/opt/java/openjdk/bin:/usr/local/sbin:/usr/local/bin:/usr/sbin:/usr/bin:/sbin:/bin, COPY_REFERENCE_FILE_LOG=/var/jenkins_home/copy_reference_file.log, RUN_DISPLAY_URL=https://services.tidalwave.it/ci/job/blueMarine2_Build_and_Quick_Test/158/display/redirect, HUDSON_HOME=/var/jenkins_home, RUN_CHANGES_DISPLAY_URL=https://services.tidalwave.it/ci/job/blueMarine2_Build_and_Quick_Test/158/display/redirect?page=changes, JOB_URL=https://services.tidalwave.it/ci/job/blueMarine2_Build_and_Quick_Test/, HUDSON_COOKIE=28307a03-4c82-42ba-948e-ed7357718aac, MAVEN_HOME=/var/jenkins_home/tools/hudson.tasks.Maven_MavenInstallation/Maven_3.6.3, JENKINS_SERVER_COOKIE=b348d8d307011da7, PWD=/var/jenkins_home/jobs/blueMarine2_Build_and_Quick_Test/workspace/modules/Commons, RUN_TESTS_DISPLAY_URL=https://services.tidalwave.it/ci/job/blueMarine2_Build_and_Quick_Test/158/display/redirect?page=tests, JENKINS_URL=https://services.tidalwave.it/ci/, KUBERNETES_PORT_443_TCP=tcp://10.96.0.1:443, POM_VERSION=1.1-ALPHA-2-SNAPSHOT, LANGUAGE=en_US:en, BUILD_TAG=jenkins-blueMarine2_Build_and_Quick_Test-158, JENKINS_SERVICE_HOST=10.98.6.166, POM_GROUPID=it.tidalwave.bluemarine2, JENKINS_PORT_8080_TCP=tcp://10.98.6.166:8080, OLDPWD=/var/jenkins_home/jobs/blueMarine2_Build_and_Quick_Test/workspace/modules/Commons, JENKINS_HOME=/var/jenkins_home, NODE_NAME=master, BUILD_DISPLAY_NAME=#158, LC_ALL=en_US.UTF-8, M2_HOME=/var/jenkins_home/tools/hudson.tasks.Maven_MavenInstallation/Maven_3.6.3, JOB_DISPLAY_URL=https://services.tidalwave.it/ci/job/blueMarine2_Build_and_Quick_Test/display/redirect, GIT_BRANCH=origin/fabrizio.giudici, JENKINS_PORT_8080_TCP_PORT=8080, KUBERNETES_SERVICE_PORT_HTTPS=443, SHLVL=0, WORKSPACE_TMP=/var/jenkins_home/jobs/blueMarine2_Build_and_Quick_Test/workspace@tmp, GIT_PREVIOUS_COMMIT=d6bf90e03992038f9a90486e5fd1f21a1a4a4b6e, POM_PACKAGING=pom, JENKINS_PORT=tcp://10.98.6.166:8080, KUBERNETES_PORT=tcp://10.96.0.1:443, JAVA_HOME=/var/jenkins_home/tools/hudson.model.JDK/AdoptOpenJDK_11.0.10_9, BUILD_ID=158, JENKINS_VERSION=2.263.4, KUBERNETES_SERVICE_HOST=10.96.0.1, LANG=en_US.UTF-8, JOB_NAME=blueMarine2_Build_and_Quick_Test, JENKINS_SERVICE_PORT=8080, MAVEN_OPTS=-DblueMarine2.musicTestSets.path=/mnt/test-data/MusicTestSets, JENKINS_PORT_8080_TCP_PROTO=tcp, JENKINS_PORT_8080_TCP_ADDR=10.98.6.166, POM_ARTIFACTID=bluemarine2, GIT_PREVIOUS_SUCCESSFUL_COMMIT=d6bf90e03992038f9a90486e5fd1f21a1a4a4b6e, NODE_LABELS=master, HUDSON_URL=https://services.tidalwave.it/ci/, WORKSPACE=/var/jenkins_home/jobs/blueMarine2_Build_and_Quick_Test/workspace, JENKINS_SLAVE_AGENT_PORT=50000, JAVA_VERSION=jdk8u282-b08, JENKINS_OPTS=--prefix=/ci, GIT_COMMIT=696c34a461e1bb7986bc74a6361cf2ae9a147509, KUBERNETES_PORT_443_TCP_ADDR=10.96.0.1, EXECUTOR_NUMBER=2, HUDSON_SERVER_COOKIE=b348d8d307011da7, JENKINS_UC=https://updates.jenkins.io, KUBERNETES_PORT_443_TCP_PROTO=tcp, JOB_BASE_NAME=blueMarine2_Build_and_Quick_Test, JENKINS_INCREMENTALS_REPO_MIRROR=https://repo.jenkins-ci.org/incrementals, KUBERNETES_SERVICE_PORT=443, REF=/usr/share/jenkins/ref, BUILD_NUMBER=158, BUILD_URL=https://services.tidalwave.it/ci/job/blueMarine2_Build_and_Quick_Test/158/, HOSTNAME=jenkins-64b9869db8-8pn4l, RUN_ARTIFACTS_DISPLAY_URL=https://services.tidalwave.it/ci/job/blueMarine2_Build_and_Quick_Test/158/display/redirect?page=artifacts, POM_DISPLAYNAME=blueMarine II, GIT_URL=https://bitbucket.org/tidalwave/bluemarine2-src.git, KUBERNETES_PORT_443_TCP_PORT=443, JENKINS_UC_EXPERIMENTAL=https://updates.jenkins.io/experimental, HOME=/var/jenkins_home]
09:54:24.814 [pool-2-thread-1     ] TRACE it.tidalwave.util.spi.DefaultProcessExecutor       - >>>>>>>> out    creating: target/zip/nfc/
09:54:24.814 [pool-2-thread-1     ] TRACE it.tidalwave.util.spi.DefaultProcessExecutor       - >>>>>>>> out  extracting: target/zip/nfc/L'Agaçante  
09:54:24.814 [pool-2-thread-1     ] TRACE it.tidalwave.util.spi.DefaultProcessExecutor       - >>>>>>>> out    creating: target/zip/nfd/
09:54:24.815 [pool-2-thread-1     ] TRACE it.tidalwave.util.spi.DefaultProcessExecutor       - >>>>>>>> out  extracting: target/zip/nfd/L'Agaçante  
09:54:24.815 [pool-2-thread-1     ] DEBUG it.tidalwave.util.spi.DefaultProcessExecutor       - >>>>>> out closed
09:54:24.817 [main                ] INFO  it.tidalwave.util.spi.DefaultProcessExecutor       - out - started
09:54:24.819 [main                ] INFO  it.tidalwave.util.spi.DefaultProcessExecutor       - err - started
09:54:24.833 [pool-3-thread-1     ] TRACE it.tidalwave.util.spi.DefaultProcessExecutor       - >>>>>>>> out nfc/
09:54:24.834 [main                ] INFO  i.tidalwave.bluemarine2.util.PathNormalizationTest - On Linux two files are extracted, with both normalizations.
09:54:24.835 [pool-3-thread-1     ] TRACE it.tidalwave.util.spi.DefaultProcessExecutor       - >>>>>>>> out nfc/L'Agaçante
09:54:24.835 [pool-3-thread-1     ] TRACE it.tidalwave.util.spi.DefaultProcessExecutor       - >>>>>>>> out nfd/
09:54:24.834 [pool-3-thread-3     ] DEBUG it.tidalwave.util.spi.DefaultProcessExecutor       - >>>>>> err closed
09:54:24.836 [pool-3-thread-1     ] TRACE it.tidalwave.util.spi.DefaultProcessExecutor       - >>>>>>>> out nfd/L'Agaçante
09:54:24.836 [pool-3-thread-1     ] DEBUG it.tidalwave.util.spi.DefaultProcessExecutor       - >>>>>> out closed
09:54:24.835 [main                ] INFO  i.tidalwave.bluemarine2.util.PathNormalizationTest - NFC:           004c 0027 0041 0067 0061 0063 0327 0061 006e 0074 0065
09:54:24.839 [main                ] INFO  i.tidalwave.bluemarine2.util.PathNormalizationTest - NFD:           004c 0027 0041 0067 0061 00e7 0061 006e 0074 0065
09:54:24.841 [main                ] INFO  i.tidalwave.bluemarine2.util.PathNormalizationTest - Extracted NFC: 004c 0027 0041 0067 0061 0063 0327 0061 006e 0074 0065
09:54:24.842 [main                ] INFO  i.tidalwave.bluemarine2.util.PathNormalizationTest - Extracted NFD: 004c 0027 0041 0067 0061 00e7 0061 006e 0074 0065
09:54:24.843 [main                ] INFO  i.tidalwave.bluemarine2.util.PathNormalizationTest - TEST PASSED in 47 msec
09:54:24.844 [main                ] INFO  i.tidalwave.bluemarine2.util.PathNormalizationTest - 
09:54:24.846 [main                ] INFO  i.tidalwave.bluemarine2.util.PathNormalizationTest - ***************************
09:54:24.846 [main                ] INFO  i.tidalwave.bluemarine2.util.PathNormalizationTest - TEST "test probe and open1"
09:54:24.846 [main                ] INFO  i.tidalwave.bluemarine2.util.PathNormalizationTest - ***************************
09:54:24.851 [main                ] INFO  i.tidalwave.bluemarine2.util.PathNormalizationTest - Extracting files from tar...
09:54:24.851 [main                ] INFO  it.tidalwave.util.spi.DefaultProcessExecutor       - >>>> executing [/bin/tar, -xvf, src/test/resources/agacantes.tar.gz, -C, target/tar] ...
09:54:24.859 [main                ] INFO  it.tidalwave.util.spi.DefaultProcessExecutor       - >>>> environment: [PATH=/var/jenkins_home/tools/hudson.tasks.Maven_MavenInstallation/Maven_3.6.3/bin:/var/jenkins_home/tools/hudson.model.JDK/AdoptOpenJDK_11.0.10_9/bin:/var/jenkins_home/tools/hudson.model.JDK/AdoptOpenJDK_11.0.10_9/bin:/opt/java/openjdk/bin:/usr/local/sbin:/usr/local/bin:/usr/sbin:/usr/bin:/sbin:/bin, COPY_REFERENCE_FILE_LOG=/var/jenkins_home/copy_reference_file.log, RUN_DISPLAY_URL=https://services.tidalwave.it/ci/job/blueMarine2_Build_and_Quick_Test/158/display/redirect, HUDSON_HOME=/var/jenkins_home, RUN_CHANGES_DISPLAY_URL=https://services.tidalwave.it/ci/job/blueMarine2_Build_and_Quick_Test/158/display/redirect?page=changes, JOB_URL=https://services.tidalwave.it/ci/job/blueMarine2_Build_and_Quick_Test/, HUDSON_COOKIE=28307a03-4c82-42ba-948e-ed7357718aac, MAVEN_HOME=/var/jenkins_home/tools/hudson.tasks.Maven_MavenInstallation/Maven_3.6.3, JENKINS_SERVER_COOKIE=b348d8d307011da7, PWD=/var/jenkins_home/jobs/blueMarine2_Build_and_Quick_Test/workspace/modules/Commons, RUN_TESTS_DISPLAY_URL=https://services.tidalwave.it/ci/job/blueMarine2_Build_and_Quick_Test/158/display/redirect?page=tests, JENKINS_URL=https://services.tidalwave.it/ci/, KUBERNETES_PORT_443_TCP=tcp://10.96.0.1:443, POM_VERSION=1.1-ALPHA-2-SNAPSHOT, LANGUAGE=en_US:en, BUILD_TAG=jenkins-blueMarine2_Build_and_Quick_Test-158, JENKINS_SERVICE_HOST=10.98.6.166, POM_GROUPID=it.tidalwave.bluemarine2, JENKINS_PORT_8080_TCP=tcp://10.98.6.166:8080, OLDPWD=/var/jenkins_home/jobs/blueMarine2_Build_and_Quick_Test/workspace/modules/Commons, JENKINS_HOME=/var/jenkins_home, NODE_NAME=master, BUILD_DISPLAY_NAME=#158, LC_ALL=en_US.UTF-8, M2_HOME=/var/jenkins_home/tools/hudson.tasks.Maven_MavenInstallation/Maven_3.6.3, JOB_DISPLAY_URL=https://services.tidalwave.it/ci/job/blueMarine2_Build_and_Quick_Test/display/redirect, GIT_BRANCH=origin/fabrizio.giudici, JENKINS_PORT_8080_TCP_PORT=8080, KUBERNETES_SERVICE_PORT_HTTPS=443, SHLVL=0, WORKSPACE_TMP=/var/jenkins_home/jobs/blueMarine2_Build_and_Quick_Test/workspace@tmp, GIT_PREVIOUS_COMMIT=d6bf90e03992038f9a90486e5fd1f21a1a4a4b6e, POM_PACKAGING=pom, JENKINS_PORT=tcp://10.98.6.166:8080, KUBERNETES_PORT=tcp://10.96.0.1:443, JAVA_HOME=/var/jenkins_home/tools/hudson.model.JDK/AdoptOpenJDK_11.0.10_9, BUILD_ID=158, JENKINS_VERSION=2.263.4, KUBERNETES_SERVICE_HOST=10.96.0.1, LANG=en_US.UTF-8, JOB_NAME=blueMarine2_Build_and_Quick_Test, JENKINS_SERVICE_PORT=8080, MAVEN_OPTS=-DblueMarine2.musicTestSets.path=/mnt/test-data/MusicTestSets, JENKINS_PORT_8080_TCP_PROTO=tcp, JENKINS_PORT_8080_TCP_ADDR=10.98.6.166, POM_ARTIFACTID=bluemarine2, GIT_PREVIOUS_SUCCESSFUL_COMMIT=d6bf90e03992038f9a90486e5fd1f21a1a4a4b6e, NODE_LABELS=master, HUDSON_URL=https://services.tidalwave.it/ci/, WORKSPACE=/var/jenkins_home/jobs/blueMarine2_Build_and_Quick_Test/workspace, JENKINS_SLAVE_AGENT_PORT=50000, JAVA_VERSION=jdk8u282-b08, JENKINS_OPTS=--prefix=/ci, GIT_COMMIT=696c34a461e1bb7986bc74a6361cf2ae9a147509, KUBERNETES_PORT_443_TCP_ADDR=10.96.0.1, EXECUTOR_NUMBER=2, HUDSON_SERVER_COOKIE=b348d8d307011da7, JENKINS_UC=https://updates.jenkins.io, KUBERNETES_PORT_443_TCP_PROTO=tcp, JOB_BASE_NAME=blueMarine2_Build_and_Quick_Test, JENKINS_INCREMENTALS_REPO_MIRROR=https://repo.jenkins-ci.org/incrementals, KUBERNETES_SERVICE_PORT=443, REF=/usr/share/jenkins/ref, BUILD_NUMBER=158, BUILD_URL=https://services.tidalwave.it/ci/job/blueMarine2_Build_and_Quick_Test/158/, HOSTNAME=jenkins-64b9869db8-8pn4l, RUN_ARTIFACTS_DISPLAY_URL=https://services.tidalwave.it/ci/job/blueMarine2_Build_and_Quick_Test/158/display/redirect?page=artifacts, POM_DISPLAYNAME=blueMarine II, GIT_URL=https://bitbucket.org/tidalwave/bluemarine2-src.git, KUBERNETES_PORT_443_TCP_PORT=443, JENKINS_UC_EXPERIMENTAL=https://updates.jenkins.io/experimental, HOME=/var/jenkins_home]
09:54:24.871 [main                ] INFO  it.tidalwave.util.spi.DefaultProcessExecutor       - out - started
09:54:24.877 [pool-4-thread-1     ] TRACE it.tidalwave.util.spi.DefaultProcessExecutor       - >>>>>>>> out nfc/
09:54:24.878 [pool-4-thread-1     ] TRACE it.tidalwave.util.spi.DefaultProcessExecutor       - >>>>>>>> out nfc/L'Agaçante
09:54:24.878 [pool-4-thread-1     ] TRACE it.tidalwave.util.spi.DefaultProcessExecutor       - >>>>>>>> out nfd/
09:54:24.878 [pool-4-thread-1     ] TRACE it.tidalwave.util.spi.DefaultProcessExecutor       - >>>>>>>> out nfd/L'Agaçante
09:54:24.879 [pool-4-thread-1     ] DEBUG it.tidalwave.util.spi.DefaultProcessExecutor       - >>>>>> out closed
09:54:24.879 [main                ] INFO  it.tidalwave.util.spi.DefaultProcessExecutor       - err - started
09:54:24.882 [main                ] INFO  i.tidalwave.bluemarine2.util.PathNormalizationTest - NFC can be opened: target/tar/nfc/L'Agaçante
09:54:24.882 [main                ] INFO  i.tidalwave.bluemarine2.util.PathNormalizationTest - NFD can be opened: target/tar/nfd/L'Agaçante
09:54:24.890 [pool-4-thread-2     ] TRACE it.tidalwave.util.spi.DefaultProcessExecutor       - >>>>>>>> out nfd/L'Agaçante
09:54:24.890 [main                ] INFO  i.tidalwave.bluemarine2.util.PathNormalizationTest - TEST PASSED in 36 msec
09:54:24.893 [main                ] INFO  i.tidalwave.bluemarine2.util.PathNormalizationTest - 
09:54:24.900 [main                ] INFO  i.tidalwave.bluemarine2.util.PathNormalizationTest - ***************************
09:54:24.900 [main                ] INFO  i.tidalwave.bluemarine2.util.PathNormalizationTest - TEST "test probe and open2"
09:54:24.900 [main                ] INFO  i.tidalwave.bluemarine2.util.PathNormalizationTest - ***************************
09:54:24.901 [main                ] INFO  i.tidalwave.bluemarine2.util.PathNormalizationTest - Extracting files from tar...
09:54:24.901 [main                ] INFO  it.tidalwave.util.spi.DefaultProcessExecutor       - >>>> executing [/bin/tar, -xvf, src/test/resources/agacantes.tar.gz, -C, target/tar] ...
09:54:24.904 [pool-4-thread-3     ] DEBUG it.tidalwave.util.spi.DefaultProcessExecutor       - >>>>>> err closed
09:54:24.908 [main                ] INFO  it.tidalwave.util.spi.DefaultProcessExecutor       - >>>> environment: [PATH=/var/jenkins_home/tools/hudson.tasks.Maven_MavenInstallation/Maven_3.6.3/bin:/var/jenkins_home/tools/hudson.model.JDK/AdoptOpenJDK_11.0.10_9/bin:/var/jenkins_home/tools/hudson.model.JDK/AdoptOpenJDK_11.0.10_9/bin:/opt/java/openjdk/bin:/usr/local/sbin:/usr/local/bin:/usr/sbin:/usr/bin:/sbin:/bin, COPY_REFERENCE_FILE_LOG=/var/jenkins_home/copy_reference_file.log, RUN_DISPLAY_URL=https://services.tidalwave.it/ci/job/blueMarine2_Build_and_Quick_Test/158/display/redirect, HUDSON_HOME=/var/jenkins_home, RUN_CHANGES_DISPLAY_URL=https://services.tidalwave.it/ci/job/blueMarine2_Build_and_Quick_Test/158/display/redirect?page=changes, JOB_URL=https://services.tidalwave.it/ci/job/blueMarine2_Build_and_Quick_Test/, HUDSON_COOKIE=28307a03-4c82-42ba-948e-ed7357718aac, MAVEN_HOME=/var/jenkins_home/tools/hudson.tasks.Maven_MavenInstallation/Maven_3.6.3, JENKINS_SERVER_COOKIE=b348d8d307011da7, PWD=/var/jenkins_home/jobs/blueMarine2_Build_and_Quick_Test/workspace/modules/Commons, RUN_TESTS_DISPLAY_URL=https://services.tidalwave.it/ci/job/blueMarine2_Build_and_Quick_Test/158/display/redirect?page=tests, JENKINS_URL=https://services.tidalwave.it/ci/, KUBERNETES_PORT_443_TCP=tcp://10.96.0.1:443, POM_VERSION=1.1-ALPHA-2-SNAPSHOT, LANGUAGE=en_US:en, BUILD_TAG=jenkins-blueMarine2_Build_and_Quick_Test-158, JENKINS_SERVICE_HOST=10.98.6.166, POM_GROUPID=it.tidalwave.bluemarine2, JENKINS_PORT_8080_TCP=tcp://10.98.6.166:8080, OLDPWD=/var/jenkins_home/jobs/blueMarine2_Build_and_Quick_Test/workspace/modules/Commons, JENKINS_HOME=/var/jenkins_home, NODE_NAME=master, BUILD_DISPLAY_NAME=#158, LC_ALL=en_US.UTF-8, M2_HOME=/var/jenkins_home/tools/hudson.tasks.Maven_MavenInstallation/Maven_3.6.3, JOB_DISPLAY_URL=https://services.tidalwave.it/ci/job/blueMarine2_Build_and_Quick_Test/display/redirect, GIT_BRANCH=origin/fabrizio.giudici, JENKINS_PORT_8080_TCP_PORT=8080, KUBERNETES_SERVICE_PORT_HTTPS=443, SHLVL=0, WORKSPACE_TMP=/var/jenkins_home/jobs/blueMarine2_Build_and_Quick_Test/workspace@tmp, GIT_PREVIOUS_COMMIT=d6bf90e03992038f9a90486e5fd1f21a1a4a4b6e, POM_PACKAGING=pom, JENKINS_PORT=tcp://10.98.6.166:8080, KUBERNETES_PORT=tcp://10.96.0.1:443, JAVA_HOME=/var/jenkins_home/tools/hudson.model.JDK/AdoptOpenJDK_11.0.10_9, BUILD_ID=158, JENKINS_VERSION=2.263.4, KUBERNETES_SERVICE_HOST=10.96.0.1, LANG=en_US.UTF-8, JOB_NAME=blueMarine2_Build_and_Quick_Test, JENKINS_SERVICE_PORT=8080, MAVEN_OPTS=-DblueMarine2.musicTestSets.path=/mnt/test-data/MusicTestSets, JENKINS_PORT_8080_TCP_PROTO=tcp, JENKINS_PORT_8080_TCP_ADDR=10.98.6.166, POM_ARTIFACTID=bluemarine2, GIT_PREVIOUS_SUCCESSFUL_COMMIT=d6bf90e03992038f9a90486e5fd1f21a1a4a4b6e, NODE_LABELS=master, HUDSON_URL=https://services.tidalwave.it/ci/, WORKSPACE=/var/jenkins_home/jobs/blueMarine2_Build_and_Quick_Test/workspace, JENKINS_SLAVE_AGENT_PORT=50000, JAVA_VERSION=jdk8u282-b08, JENKINS_OPTS=--prefix=/ci, GIT_COMMIT=696c34a461e1bb7986bc74a6361cf2ae9a147509, KUBERNETES_PORT_443_TCP_ADDR=10.96.0.1, EXECUTOR_NUMBER=2, HUDSON_SERVER_COOKIE=b348d8d307011da7, JENKINS_UC=https://updates.jenkins.io, KUBERNETES_PORT_443_TCP_PROTO=tcp, JOB_BASE_NAME=blueMarine2_Build_and_Quick_Test, JENKINS_INCREMENTALS_REPO_MIRROR=https://repo.jenkins-ci.org/incrementals, KUBERNETES_SERVICE_PORT=443, REF=/usr/share/jenkins/ref, BUILD_NUMBER=158, BUILD_URL=https://services.tidalwave.it/ci/job/blueMarine2_Build_and_Quick_Test/158/, HOSTNAME=jenkins-64b9869db8-8pn4l, RUN_ARTIFACTS_DISPLAY_URL=https://services.tidalwave.it/ci/job/blueMarine2_Build_and_Quick_Test/158/display/redirect?page=artifacts, POM_DISPLAYNAME=blueMarine II, GIT_URL=https://bitbucket.org/tidalwave/bluemarine2-src.git, KUBERNETES_PORT_443_TCP_PORT=443, JENKINS_UC_EXPERIMENTAL=https://updates.jenkins.io/experimental, HOME=/var/jenkins_home]
09:54:24.910 [main                ] INFO  it.tidalwave.util.spi.DefaultProcessExecutor       - out - started
09:54:24.914 [main                ] INFO  it.tidalwave.util.spi.DefaultProcessExecutor       - err - started
09:54:24.916 [pool-5-thread-1     ] TRACE it.tidalwave.util.spi.DefaultProcessExecutor       - >>>>>>>> out nfc/
09:54:24.916 [pool-5-thread-1     ] TRACE it.tidalwave.util.spi.DefaultProcessExecutor       - >>>>>>>> out nfc/L'Agaçante
09:54:24.917 [pool-5-thread-1     ] TRACE it.tidalwave.util.spi.DefaultProcessExecutor       - >>>>>>>> out nfd/
09:54:24.917 [pool-5-thread-1     ] TRACE it.tidalwave.util.spi.DefaultProcessExecutor       - >>>>>>>> out nfd/L'Agaçante
09:54:24.918 [pool-5-thread-3     ] DEBUG it.tidalwave.util.spi.DefaultProcessExecutor       - >>>>>> err closed
09:54:24.919 [pool-5-thread-1     ] DEBUG it.tidalwave.util.spi.DefaultProcessExecutor       - >>>>>> out closed
09:54:24.920 [main                ] INFO  i.tidalwave.bluemarine2.util.PathNormalizationTest - NFC can't be opened, as expected: target/tar/nfc/L'Agaçante
09:54:24.923 [main                ] INFO  i.tidalwave.bluemarine2.util.PathNormalizationTest - NFD can be opened: target/tar/nfd/L'Agaçante
09:54:24.924 [main                ] INFO  i.tidalwave.bluemarine2.util.PathNormalizationTest - TEST PASSED in 25 msec
09:54:24.924 [main                ] INFO  i.tidalwave.bluemarine2.util.PathNormalizationTest - 
09:54:24.925 [main                ] INFO  i.tidalwave.bluemarine2.util.PathNormalizationTest - *********************
09:54:24.925 [main                ] INFO  i.tidalwave.bluemarine2.util.PathNormalizationTest - TEST "test fixedPath"
09:54:24.925 [main                ] INFO  i.tidalwave.bluemarine2.util.PathNormalizationTest - *********************
09:54:24.925 [main                ] INFO  i.tidalwave.bluemarine2.util.PathNormalizationTest - Extracting files from tar...
09:54:24.925 [main                ] INFO  it.tidalwave.util.spi.DefaultProcessExecutor       - >>>> executing [/bin/tar, -xvf, src/test/resources/agacantes.tar.gz, -C, target/tar] ...
09:54:24.927 [main                ] INFO  it.tidalwave.util.spi.DefaultProcessExecutor       - >>>> environment: [PATH=/var/jenkins_home/tools/hudson.tasks.Maven_MavenInstallation/Maven_3.6.3/bin:/var/jenkins_home/tools/hudson.model.JDK/AdoptOpenJDK_11.0.10_9/bin:/var/jenkins_home/tools/hudson.model.JDK/AdoptOpenJDK_11.0.10_9/bin:/opt/java/openjdk/bin:/usr/local/sbin:/usr/local/bin:/usr/sbin:/usr/bin:/sbin:/bin, COPY_REFERENCE_FILE_LOG=/var/jenkins_home/copy_reference_file.log, RUN_DISPLAY_URL=https://services.tidalwave.it/ci/job/blueMarine2_Build_and_Quick_Test/158/display/redirect, HUDSON_HOME=/var/jenkins_home, RUN_CHANGES_DISPLAY_URL=https://services.tidalwave.it/ci/job/blueMarine2_Build_and_Quick_Test/158/display/redirect?page=changes, JOB_URL=https://services.tidalwave.it/ci/job/blueMarine2_Build_and_Quick_Test/, HUDSON_COOKIE=28307a03-4c82-42ba-948e-ed7357718aac, MAVEN_HOME=/var/jenkins_home/tools/hudson.tasks.Maven_MavenInstallation/Maven_3.6.3, JENKINS_SERVER_COOKIE=b348d8d307011da7, PWD=/var/jenkins_home/jobs/blueMarine2_Build_and_Quick_Test/workspace/modules/Commons, RUN_TESTS_DISPLAY_URL=https://services.tidalwave.it/ci/job/blueMarine2_Build_and_Quick_Test/158/display/redirect?page=tests, JENKINS_URL=https://services.tidalwave.it/ci/, KUBERNETES_PORT_443_TCP=tcp://10.96.0.1:443, POM_VERSION=1.1-ALPHA-2-SNAPSHOT, LANGUAGE=en_US:en, BUILD_TAG=jenkins-blueMarine2_Build_and_Quick_Test-158, JENKINS_SERVICE_HOST=10.98.6.166, POM_GROUPID=it.tidalwave.bluemarine2, JENKINS_PORT_8080_TCP=tcp://10.98.6.166:8080, OLDPWD=/var/jenkins_home/jobs/blueMarine2_Build_and_Quick_Test/workspace/modules/Commons, JENKINS_HOME=/var/jenkins_home, NODE_NAME=master, BUILD_DISPLAY_NAME=#158, LC_ALL=en_US.UTF-8, M2_HOME=/var/jenkins_home/tools/hudson.tasks.Maven_MavenInstallation/Maven_3.6.3, JOB_DISPLAY_URL=https://services.tidalwave.it/ci/job/blueMarine2_Build_and_Quick_Test/display/redirect, GIT_BRANCH=origin/fabrizio.giudici, JENKINS_PORT_8080_TCP_PORT=8080, KUBERNETES_SERVICE_PORT_HTTPS=443, SHLVL=0, WORKSPACE_TMP=/var/jenkins_home/jobs/blueMarine2_Build_and_Quick_Test/workspace@tmp, GIT_PREVIOUS_COMMIT=d6bf90e03992038f9a90486e5fd1f21a1a4a4b6e, POM_PACKAGING=pom, JENKINS_PORT=tcp://10.98.6.166:8080, KUBERNETES_PORT=tcp://10.96.0.1:443, JAVA_HOME=/var/jenkins_home/tools/hudson.model.JDK/AdoptOpenJDK_11.0.10_9, BUILD_ID=158, JENKINS_VERSION=2.263.4, KUBERNETES_SERVICE_HOST=10.96.0.1, LANG=en_US.UTF-8, JOB_NAME=blueMarine2_Build_and_Quick_Test, JENKINS_SERVICE_PORT=8080, MAVEN_OPTS=-DblueMarine2.musicTestSets.path=/mnt/test-data/MusicTestSets, JENKINS_PORT_8080_TCP_PROTO=tcp, JENKINS_PORT_8080_TCP_ADDR=10.98.6.166, POM_ARTIFACTID=bluemarine2, GIT_PREVIOUS_SUCCESSFUL_COMMIT=d6bf90e03992038f9a90486e5fd1f21a1a4a4b6e, NODE_LABELS=master, HUDSON_URL=https://services.tidalwave.it/ci/, WORKSPACE=/var/jenkins_home/jobs/blueMarine2_Build_and_Quick_Test/workspace, JENKINS_SLAVE_AGENT_PORT=50000, JAVA_VERSION=jdk8u282-b08, JENKINS_OPTS=--prefix=/ci, GIT_COMMIT=696c34a461e1bb7986bc74a6361cf2ae9a147509, KUBERNETES_PORT_443_TCP_ADDR=10.96.0.1, EXECUTOR_NUMBER=2, HUDSON_SERVER_COOKIE=b348d8d307011da7, JENKINS_UC=https://updates.jenkins.io, KUBERNETES_PORT_443_TCP_PROTO=tcp, JOB_BASE_NAME=blueMarine2_Build_and_Quick_Test, JENKINS_INCREMENTALS_REPO_MIRROR=https://repo.jenkins-ci.org/incrementals, KUBERNETES_SERVICE_PORT=443, REF=/usr/share/jenkins/ref, BUILD_NUMBER=158, BUILD_URL=https://services.tidalwave.it/ci/job/blueMarine2_Build_and_Quick_Test/158/, HOSTNAME=jenkins-64b9869db8-8pn4l, RUN_ARTIFACTS_DISPLAY_URL=https://services.tidalwave.it/ci/job/blueMarine2_Build_and_Quick_Test/158/display/redirect?page=artifacts, POM_DISPLAYNAME=blueMarine II, GIT_URL=https://bitbucket.org/tidalwave/bluemarine2-src.git, KUBERNETES_PORT_443_TCP_PORT=443, JENKINS_UC_EXPERIMENTAL=https://updates.jenkins.io/experimental, HOME=/var/jenkins_home]
09:54:24.934 [main                ] INFO  it.tidalwave.util.spi.DefaultProcessExecutor       - out - started
09:54:24.935 [main                ] INFO  it.tidalwave.util.spi.DefaultProcessExecutor       - err - started
09:54:24.938 [pool-6-thread-1     ] TRACE it.tidalwave.util.spi.DefaultProcessExecutor       - >>>>>>>> out nfc/
09:54:24.938 [pool-6-thread-3     ] DEBUG it.tidalwave.util.spi.DefaultProcessExecutor       - >>>>>> err closed
09:54:24.938 [pool-6-thread-1     ] TRACE it.tidalwave.util.spi.DefaultProcessExecutor       - >>>>>>>> out nfc/L'Agaçante
09:54:24.938 [pool-6-thread-1     ] TRACE it.tidalwave.util.spi.DefaultProcessExecutor       - >>>>>>>> out nfd/
09:54:24.941 [pool-6-thread-1     ] TRACE it.tidalwave.util.spi.DefaultProcessExecutor       - >>>>>>>> out nfd/L'Agaçante
09:54:24.941 [pool-6-thread-1     ] DEBUG it.tidalwave.util.spi.DefaultProcessExecutor       - >>>>>> out closed
09:54:24.943 [main                ] INFO  i.tidalwave.bluemarine2.util.PathNormalizationTest - NFC can be opened: /var/jenkins_home/jobs/blueMarine2_Build_and_Quick_Test/workspace/modules/Commons/target/tar/nfc/L'Agaçante
09:54:24.944 [main                ] INFO  i.tidalwave.bluemarine2.util.PathNormalizationTest - NFD can be opened: target/tar/nfd/L'Agaçante
09:54:24.944 [main                ] INFO  i.tidalwave.bluemarine2.util.PathNormalizationTest - TEST PASSED in 19 msec
09:54:24.944 [main                ] INFO  i.tidalwave.bluemarine2.util.PathNormalizationTest - 
09:54:24.984 [main                ] INFO  i.tidalwave.bluemarine2.util.PathNormalizationTest - FINISHED TESTS OF it.tidalwave.bluemarine2.util.PathNormalizationTest
[INFO] Tests run: 9, Failures: 0, Errors: 0, Skipped: 0, Time elapsed: 0.972 s - in it.tidalwave.bluemarine2.util.PathNormalizationTest
[INFO] 
[INFO] Results:
[INFO] 
[INFO] Tests run: 9, Failures: 0, Errors: 0, Skipped: 0
[INFO] 
[JENKINS] Recording test results
[INFO] 
[INFO] --- maven-jar-plugin:3.2.0:jar (default-jar) @ it-tidalwave-bluemarine2-commons ---
[INFO] Building jar: /var/jenkins_home/jobs/blueMarine2_Build_and_Quick_Test/workspace/modules/Commons/target/it-tidalwave-bluemarine2-commons-1.1-ALPHA-2-SNAPSHOT.696c34a461e1.jar
[INFO] 
[INFO] --- maven-jar-plugin:3.2.0:test-jar (default-test-jar) @ it-tidalwave-bluemarine2-commons ---
[INFO] Building jar: /var/jenkins_home/jobs/blueMarine2_Build_and_Quick_Test/workspace/modules/Commons/target/it-tidalwave-bluemarine2-commons-1.1-ALPHA-2-SNAPSHOT.696c34a461e1-tests.jar
[INFO] 
[INFO] --- maven-install-plugin:3.0.0-M1:install (default-install) @ it-tidalwave-bluemarine2-commons ---
[INFO] Installing /var/jenkins_home/jobs/blueMarine2_Build_and_Quick_Test/workspace/modules/Commons/target/it-tidalwave-bluemarine2-commons-1.1-ALPHA-2-SNAPSHOT.696c34a461e1.jar to /var/jenkins_home/maven-repositories/2/it/tidalwave/bluemarine2/it-tidalwave-bluemarine2-commons/1.1-ALPHA-2-SNAPSHOT/it-tidalwave-bluemarine2-commons-1.1-ALPHA-2-SNAPSHOT.jar
[INFO] Installing /var/jenkins_home/jobs/blueMarine2_Build_and_Quick_Test/workspace/modules/Commons/pom.xml to /var/jenkins_home/maven-repositories/2/it/tidalwave/bluemarine2/it-tidalwave-bluemarine2-commons/1.1-ALPHA-2-SNAPSHOT/it-tidalwave-bluemarine2-commons-1.1-ALPHA-2-SNAPSHOT.pom
[INFO] Installing /var/jenkins_home/jobs/blueMarine2_Build_and_Quick_Test/workspace/modules/Commons/target/it-tidalwave-bluemarine2-commons-1.1-ALPHA-2-SNAPSHOT.696c34a461e1-tests.jar to /var/jenkins_home/maven-repositories/2/it/tidalwave/bluemarine2/it-tidalwave-bluemarine2-commons/1.1-ALPHA-2-SNAPSHOT/it-tidalwave-bluemarine2-commons-1.1-ALPHA-2-SNAPSHOT-tests.jar
[JENKINS] Archiving disabled
Started calculate disk usage of build
Finished Calculation of disk usage of build in 0 seconds
Started calculate disk usage of workspace
Finished Calculation of disk usage of workspace in 0 seconds
[INFO] 
[INFO] --< it.tidalwave.bluemarine2:it-tidalwave-bluemarine2-phaseone-captureone11-applescript >--
[INFO] Building blueMarine II :: Capture One 11 Applescript 1.1-ALPHA-2-SNAPSHOT [4/26]
[INFO] --------------------------------[ jar ]---------------------------------
[INFO] 
[INFO] --- maven-clean-plugin:3.1.0:clean (default-clean) @ it-tidalwave-bluemarine2-phaseone-captureone11-applescript ---
[INFO] 
[INFO] --- buildnumber-maven-plugin:1.4:create (default) @ it-tidalwave-bluemarine2-phaseone-captureone11-applescript ---
[INFO] ShortRevision tag detected. The value is '12'.
[INFO] Executing: /bin/sh -c cd '/var/jenkins_home/jobs/blueMarine2_Build_and_Quick_Test/workspace/modules/CaptureOneAppleScript' && 'git' 'rev-parse' '--verify' '--short=12' 'HEAD'
[INFO] Working directory: /var/jenkins_home/jobs/blueMarine2_Build_and_Quick_Test/workspace/modules/CaptureOneAppleScript
[INFO] Storing buildNumber: 696c34a461e1 at timestamp: 1640163268018
[WARNING] Cannot get the branch information from the git repository: 
Detecting the current branch failed: fatal: ref HEAD is not a symbolic ref

[INFO] ShortRevision tag detected. The value is '12'.
[INFO] Executing: /bin/sh -c cd '/var/jenkins_home/jobs/blueMarine2_Build_and_Quick_Test/workspace/modules/CaptureOneAppleScript' && 'git' 'rev-parse' '--verify' '--short=12' 'HEAD'
[INFO] Working directory: /var/jenkins_home/jobs/blueMarine2_Build_and_Quick_Test/workspace/modules/CaptureOneAppleScript
[INFO] Storing buildScmBranch: UNKNOWN
[INFO] 
[INFO] --- maven-enforcer-plugin:3.0.0-M3:enforce (enforce-maven) @ it-tidalwave-bluemarine2-phaseone-captureone11-applescript ---
[INFO] 
[INFO] --- maven-enforcer-plugin:3.0.0-M3:enforce (enforce-banned-dependencies) @ it-tidalwave-bluemarine2-phaseone-captureone11-applescript ---
[INFO] 
[INFO] --- maven-antrun-plugin:3.0.0:run (generate-and-print-build-description) @ it-tidalwave-bluemarine2-phaseone-captureone11-applescript ---
[INFO] Executing tasks
[INFO]      [echo] DESCRIPTION: origin/fabrizio.giudici 1.1-ALPHA-2-SNAPSHOT 696c34a461e1
[INFO]      [echo] Java Version: 11.0.10 -source 11 -target 11 -release 11
[INFO] Executed tasks
[INFO] 
[INFO] --- maven-resources-plugin:3.2.0:resources (default-resources) @ it-tidalwave-bluemarine2-phaseone-captureone11-applescript ---
[INFO] Using 'UTF-8' encoding to copy filtered resources.
[INFO] Using 'UTF-8' encoding to copy filtered properties files.
[INFO] Copying 2 resources
[INFO] 
[INFO] --- maven-compiler-plugin:3.8.1:compile (default-compile) @ it-tidalwave-bluemarine2-phaseone-captureone11-applescript ---
[INFO] Changes detected - recompiling the module!
[INFO] Compiling 5 source files to /var/jenkins_home/jobs/blueMarine2_Build_and_Quick_Test/workspace/modules/CaptureOneAppleScript/target/classes
[WARNING] No processor claimed any of these annotations: /jakarta.xml.bind.annotation.XmlRootElement,/jakarta.xml.bind.annotation.XmlElementWrapper,/javax.annotation.Nonnull,/jakarta.xml.bind.annotation.XmlAccessorType,/jakarta.xml.bind.annotation.XmlElement,java.base/java.lang.SuppressWarnings,java.base/java.lang.Override
[INFO] 
[INFO] --- maven-resources-plugin:3.2.0:testResources (default-testResources) @ it-tidalwave-bluemarine2-phaseone-captureone11-applescript ---
[INFO] Using 'UTF-8' encoding to copy filtered resources.
[INFO] Using 'UTF-8' encoding to copy filtered properties files.
[INFO] Copying 2 resources
[INFO] 
[INFO] --- maven-compiler-plugin:3.8.1:testCompile (default-testCompile) @ it-tidalwave-bluemarine2-phaseone-captureone11-applescript ---
[INFO] Changes detected - recompiling the module!
[INFO] Compiling 1 source file to /var/jenkins_home/jobs/blueMarine2_Build_and_Quick_Test/workspace/modules/CaptureOneAppleScript/target/test-classes
[WARNING] [path] bad path element "/var/jenkins_home/maven-repositories/2/com/sun/xml/bind/jaxb-impl/3.0.0/jaxb-core.jar": no such file or directory
[WARNING] No processor claimed any of these annotations: /org.testng.annotations.Test,/javax.annotation.Nonnull
[INFO] 
[INFO] --- maven-surefire-plugin:3.0.0-M5:test (default-test) @ it-tidalwave-bluemarine2-phaseone-captureone11-applescript ---
[INFO] 
[INFO] -------------------------------------------------------
[INFO]  T E S T S
[INFO] -------------------------------------------------------
[INFO] Running it.tidalwave.bluemarine2.captureone.impl.applescript.AppleScriptCaptureOneDaoTest
09:54:37.076 [main                ] INFO  i.t.b.c.i.applescript.AppleScriptCaptureOneDaoTest - STARTING TESTS OF it.tidalwave.bluemarine2.captureone.impl.applescript.AppleScriptCaptureOneDaoTest
09:54:37.090 [main                ] INFO  i.t.b.c.i.applescript.AppleScriptCaptureOneDaoTest - ***********************************
09:54:37.091 [main                ] INFO  i.t.b.c.i.applescript.AppleScriptCaptureOneDaoTest - TEST "must properly parse document"
09:54:37.091 [main                ] INFO  i.t.b.c.i.applescript.AppleScriptCaptureOneDaoTest - ***********************************
09:54:38.208 [main                ] INFO  it.tidalwave.util.test.FileComparisonUtils         - ******** Comparing files:
09:54:38.208 [main                ] INFO  it.tidalwave.util.test.FileComparisonUtils         - >>>> path is: /var/jenkins_home/jobs/blueMarine2_Build_and_Quick_Test/workspace/modules/CaptureOneAppleScript/target/
09:54:38.209 [main                ] INFO  it.tidalwave.util.test.FileComparisonUtils         - >>>> exp is:  test-classes/expected-results/document.txt
09:54:38.209 [main                ] INFO  it.tidalwave.util.test.FileComparisonUtils         - >>>> act is:  test-results/document.txt
09:54:38.266 [main                ] INFO  i.t.b.c.i.applescript.AppleScriptCaptureOneDaoTest - TEST PASSED in 1177 msec
09:54:38.267 [main                ] INFO  i.t.b.c.i.applescript.AppleScriptCaptureOneDaoTest - 
09:54:38.325 [main                ] INFO  i.t.b.c.i.applescript.AppleScriptCaptureOneDaoTest - FINISHED TESTS OF it.tidalwave.bluemarine2.captureone.impl.applescript.AppleScriptCaptureOneDaoTest
[INFO] Tests run: 1, Failures: 0, Errors: 0, Skipped: 0, Time elapsed: 2.499 s - in it.tidalwave.bluemarine2.captureone.impl.applescript.AppleScriptCaptureOneDaoTest
[INFO] 
[INFO] Results:
[INFO] 
[INFO] Tests run: 1, Failures: 0, Errors: 0, Skipped: 0
[INFO] 
[JENKINS] Recording test results
[INFO] 
[INFO] --- maven-jar-plugin:3.2.0:jar (default-jar) @ it-tidalwave-bluemarine2-phaseone-captureone11-applescript ---
[INFO] Building jar: /var/jenkins_home/jobs/blueMarine2_Build_and_Quick_Test/workspace/modules/CaptureOneAppleScript/target/it-tidalwave-bluemarine2-phaseone-captureone11-applescript-1.1-ALPHA-2-SNAPSHOT.696c34a461e1.jar
[INFO] 
[INFO] --- maven-jar-plugin:3.2.0:test-jar (default-test-jar) @ it-tidalwave-bluemarine2-phaseone-captureone11-applescript ---
[INFO] Building jar: /var/jenkins_home/jobs/blueMarine2_Build_and_Quick_Test/workspace/modules/CaptureOneAppleScript/target/it-tidalwave-bluemarine2-phaseone-captureone11-applescript-1.1-ALPHA-2-SNAPSHOT.696c34a461e1-tests.jar
[INFO] 
[INFO] --- maven-install-plugin:3.0.0-M1:install (default-install) @ it-tidalwave-bluemarine2-phaseone-captureone11-applescript ---
[INFO] Installing /var/jenkins_home/jobs/blueMarine2_Build_and_Quick_Test/workspace/modules/CaptureOneAppleScript/target/it-tidalwave-bluemarine2-phaseone-captureone11-applescript-1.1-ALPHA-2-SNAPSHOT.696c34a461e1.jar to /var/jenkins_home/maven-repositories/2/it/tidalwave/bluemarine2/it-tidalwave-bluemarine2-phaseone-captureone11-applescript/1.1-ALPHA-2-SNAPSHOT/it-tidalwave-bluemarine2-phaseone-captureone11-applescript-1.1-ALPHA-2-SNAPSHOT.jar
[INFO] Installing /var/jenkins_home/jobs/blueMarine2_Build_and_Quick_Test/workspace/modules/CaptureOneAppleScript/pom.xml to /var/jenkins_home/maven-repositories/2/it/tidalwave/bluemarine2/it-tidalwave-bluemarine2-phaseone-captureone11-applescript/1.1-ALPHA-2-SNAPSHOT/it-tidalwave-bluemarine2-phaseone-captureone11-applescript-1.1-ALPHA-2-SNAPSHOT.pom
[INFO] Installing /var/jenkins_home/jobs/blueMarine2_Build_and_Quick_Test/workspace/modules/CaptureOneAppleScript/target/it-tidalwave-bluemarine2-phaseone-captureone11-applescript-1.1-ALPHA-2-SNAPSHOT.696c34a461e1-tests.jar to /var/jenkins_home/maven-repositories/2/it/tidalwave/bluemarine2/it-tidalwave-bluemarine2-phaseone-captureone11-applescript/1.1-ALPHA-2-SNAPSHOT/it-tidalwave-bluemarine2-phaseone-captureone11-applescript-1.1-ALPHA-2-SNAPSHOT-tests.jar
[JENKINS] Archiving disabled
Started calculate disk usage of build
Finished Calculation of disk usage of build in 0 seconds
Started calculate disk usage of workspace
Finished Calculation of disk usage of workspace in 0 seconds
[INFO] 
[INFO] ---< it.tidalwave.bluemarine2:it-tidalwave-bluemarine2-commons-test >---
[INFO] Building blueMarine II :: Commons for Tests 1.1-ALPHA-2-SNAPSHOT  [5/26]
[INFO] --------------------------------[ jar ]---------------------------------
[INFO] 
[INFO] --- maven-clean-plugin:3.1.0:clean (default-clean) @ it-tidalwave-bluemarine2-commons-test ---
[INFO] 
[INFO] --- buildnumber-maven-plugin:1.4:create (default) @ it-tidalwave-bluemarine2-commons-test ---
[INFO] ShortRevision tag detected. The value is '12'.
[INFO] Executing: /bin/sh -c cd '/var/jenkins_home/jobs/blueMarine2_Build_and_Quick_Test/workspace/modules/TestCommons' && 'git' 'rev-parse' '--verify' '--short=12' 'HEAD'
[INFO] Working directory: /var/jenkins_home/jobs/blueMarine2_Build_and_Quick_Test/workspace/modules/TestCommons
[INFO] Storing buildNumber: 696c34a461e1 at timestamp: 1640163280048
[WARNING] Cannot get the branch information from the git repository: 
Detecting the current branch failed: fatal: ref HEAD is not a symbolic ref

[INFO] ShortRevision tag detected. The value is '12'.
[INFO] Executing: /bin/sh -c cd '/var/jenkins_home/jobs/blueMarine2_Build_and_Quick_Test/workspace/modules/TestCommons' && 'git' 'rev-parse' '--verify' '--short=12' 'HEAD'
[INFO] Working directory: /var/jenkins_home/jobs/blueMarine2_Build_and_Quick_Test/workspace/modules/TestCommons
[INFO] Storing buildScmBranch: UNKNOWN
[INFO] 
[INFO] --- maven-enforcer-plugin:3.0.0-M3:enforce (enforce-maven) @ it-tidalwave-bluemarine2-commons-test ---
[INFO] 
[INFO] --- maven-enforcer-plugin:3.0.0-M3:enforce (enforce-banned-dependencies) @ it-tidalwave-bluemarine2-commons-test ---
[INFO] 
[INFO] --- maven-antrun-plugin:3.0.0:run (generate-and-print-build-description) @ it-tidalwave-bluemarine2-commons-test ---
[INFO] Executing tasks
[INFO]      [echo] DESCRIPTION: origin/fabrizio.giudici 1.1-ALPHA-2-SNAPSHOT 696c34a461e1
[INFO]      [echo] Java Version: 11.0.10 -source 11 -target 11 -release 11
[INFO] Executed tasks
[INFO] 
[INFO] --- maven-resources-plugin:3.2.0:resources (default-resources) @ it-tidalwave-bluemarine2-commons-test ---
[INFO] Using 'UTF-8' encoding to copy filtered resources.
[INFO] Using 'UTF-8' encoding to copy filtered properties files.
[INFO] skip non existing resourceDirectory /var/jenkins_home/jobs/blueMarine2_Build_and_Quick_Test/workspace/modules/TestCommons/src/main/resources
[INFO] 
[INFO] --- maven-compiler-plugin:3.8.1:compile (default-compile) @ it-tidalwave-bluemarine2-commons-test ---
[INFO] Changes detected - recompiling the module!
[INFO] Compiling 6 source files to /var/jenkins_home/jobs/blueMarine2_Build_and_Quick_Test/workspace/modules/TestCommons/target/classes
[WARNING] No processor claimed any of these annotations: /javax.annotation.Nonnull,/org.testng.annotations.BeforeMethod,/org.testng.annotations.AfterClass,/org.testng.annotations.BeforeClass,/javax.annotation.Nonnegative,/org.testng.annotations.AfterMethod,java.base/java.lang.Override
[WARNING] /var/jenkins_home/jobs/blueMarine2_Build_and_Quick_Test/workspace/modules/TestCommons/src/main/java/it/tidalwave/bluemarine2/commons/test/TestUtilities.java:[82,23] [rawtypes] found raw type: SimpleComposite
  missing type arguments for generic class SimpleComposite<TYPE>
  where TYPE is a type-variable:
    TYPE extends Object declared in interface SimpleComposite
[WARNING] /var/jenkins_home/jobs/blueMarine2_Build_and_Quick_Test/workspace/modules/TestCommons/src/main/java/it/tidalwave/bluemarine2/commons/test/TestUtilities.java:[83,67] [unchecked] unchecked call to forEach(Consumer<? super T>) as a member of the raw type Iterable
  where T is a type-variable:
    T extends Object declared in interface Iterable
[INFO] 
[INFO] --- maven-resources-plugin:3.2.0:testResources (default-testResources) @ it-tidalwave-bluemarine2-commons-test ---
[INFO] Using 'UTF-8' encoding to copy filtered resources.
[INFO] Using 'UTF-8' encoding to copy filtered properties files.
[INFO] skip non existing resourceDirectory /var/jenkins_home/jobs/blueMarine2_Build_and_Quick_Test/workspace/modules/TestCommons/src/test/resources
[INFO] 
[INFO] --- maven-compiler-plugin:3.8.1:testCompile (default-testCompile) @ it-tidalwave-bluemarine2-commons-test ---
[INFO] No sources to compile
[INFO] 
[INFO] --- maven-surefire-plugin:3.0.0-M5:test (default-test) @ it-tidalwave-bluemarine2-commons-test ---
[INFO] No tests to run.
[JENKINS] Recording test results
[INFO] 
[INFO] --- maven-jar-plugin:3.2.0:jar (default-jar) @ it-tidalwave-bluemarine2-commons-test ---
[INFO] Building jar: /var/jenkins_home/jobs/blueMarine2_Build_and_Quick_Test/workspace/modules/TestCommons/target/it-tidalwave-bluemarine2-commons-test-1.1-ALPHA-2-SNAPSHOT.696c34a461e1.jar
[INFO] 
[INFO] --- maven-jar-plugin:3.2.0:test-jar (default-test-jar) @ it-tidalwave-bluemarine2-commons-test ---
[INFO] Skipping packaging of the test-jar
[INFO] 
[INFO] --- maven-install-plugin:3.0.0-M1:install (default-install) @ it-tidalwave-bluemarine2-commons-test ---
[INFO] Installing /var/jenkins_home/jobs/blueMarine2_Build_and_Quick_Test/workspace/modules/TestCommons/target/it-tidalwave-bluemarine2-commons-test-1.1-ALPHA-2-SNAPSHOT.696c34a461e1.jar to /var/jenkins_home/maven-repositories/2/it/tidalwave/bluemarine2/it-tidalwave-bluemarine2-commons-test/1.1-ALPHA-2-SNAPSHOT/it-tidalwave-bluemarine2-commons-test-1.1-ALPHA-2-SNAPSHOT.jar
[INFO] Installing /var/jenkins_home/jobs/blueMarine2_Build_and_Quick_Test/workspace/modules/TestCommons/pom.xml to /var/jenkins_home/maven-repositories/2/it/tidalwave/bluemarine2/it-tidalwave-bluemarine2-commons-test/1.1-ALPHA-2-SNAPSHOT/it-tidalwave-bluemarine2-commons-test-1.1-ALPHA-2-SNAPSHOT.pom
[JENKINS] Archiving disabled
Started calculate disk usage of build
Finished Calculation of disk usage of build in 0 seconds
Started calculate disk usage of workspace
Finished Calculation of disk usage of workspace in 0 seconds
[INFO] 
[INFO] ------< it.tidalwave.bluemarine2:it-tidalwave-bluemarine2-model >-------
[INFO] Building blueMarine II :: Model 1.1-ALPHA-2-SNAPSHOT              [6/26]
[INFO] --------------------------------[ jar ]---------------------------------
[INFO] Downloading from maven-proxy.tidalwave.it: https://services.tidalwave.it/nexus/content/groups/public/net/jthink/jaudiotagger/3.0.1/jaudiotagger-3.0.1.pom
[INFO] Downloaded from maven-proxy.tidalwave.it: https://services.tidalwave.it/nexus/content/groups/public/net/jthink/jaudiotagger/3.0.1/jaudiotagger-3.0.1.pom (11 kB at 16 kB/s)
[INFO] Downloading from maven-proxy.tidalwave.it: https://services.tidalwave.it/nexus/content/groups/public/net/jthink/jaudiotagger/3.0.1/jaudiotagger-3.0.1.jar
[INFO] Downloaded from maven-proxy.tidalwave.it: https://services.tidalwave.it/nexus/content/groups/public/net/jthink/jaudiotagger/3.0.1/jaudiotagger-3.0.1.jar (1.2 MB at 2.5 MB/s)
[INFO] 
[INFO] --- maven-clean-plugin:3.1.0:clean (default-clean) @ it-tidalwave-bluemarine2-model ---
[INFO] 
[INFO] --- buildnumber-maven-plugin:1.4:create (default) @ it-tidalwave-bluemarine2-model ---
[INFO] ShortRevision tag detected. The value is '12'.
[INFO] Executing: /bin/sh -c cd '/var/jenkins_home/jobs/blueMarine2_Build_and_Quick_Test/workspace/modules/Model' && 'git' 'rev-parse' '--verify' '--short=12' 'HEAD'
[INFO] Working directory: /var/jenkins_home/jobs/blueMarine2_Build_and_Quick_Test/workspace/modules/Model
[INFO] Storing buildNumber: 696c34a461e1 at timestamp: 1640163288523
[WARNING] Cannot get the branch information from the git repository: 
Detecting the current branch failed: fatal: ref HEAD is not a symbolic ref

[INFO] ShortRevision tag detected. The value is '12'.
[INFO] Executing: /bin/sh -c cd '/var/jenkins_home/jobs/blueMarine2_Build_and_Quick_Test/workspace/modules/Model' && 'git' 'rev-parse' '--verify' '--short=12' 'HEAD'
[INFO] Working directory: /var/jenkins_home/jobs/blueMarine2_Build_and_Quick_Test/workspace/modules/Model
[INFO] Storing buildScmBranch: UNKNOWN
[INFO] 
[INFO] --- maven-enforcer-plugin:3.0.0-M3:enforce (enforce-maven) @ it-tidalwave-bluemarine2-model ---
[INFO] 
[INFO] --- maven-enforcer-plugin:3.0.0-M3:enforce (enforce-banned-dependencies) @ it-tidalwave-bluemarine2-model ---
[INFO] 
[INFO] --- maven-antrun-plugin:3.0.0:run (generate-and-print-build-description) @ it-tidalwave-bluemarine2-model ---
[INFO] Executing tasks
[INFO]      [echo] DESCRIPTION: origin/fabrizio.giudici 1.1-ALPHA-2-SNAPSHOT 696c34a461e1
[INFO]      [echo] Java Version: 11.0.10 -source 11 -target 11 -release 11
[INFO] Executed tasks
[INFO] 
[INFO] --- maven-antrun-plugin:3.0.0:run (create-unwoven-classes-dirs) @ it-tidalwave-bluemarine2-model ---
[INFO] Executing tasks
[INFO]     [mkdir] Created dir: /var/jenkins_home/jobs/blueMarine2_Build_and_Quick_Test/workspace/modules/Model/target/unwoven-classes
[INFO]     [mkdir] Created dir: /var/jenkins_home/jobs/blueMarine2_Build_and_Quick_Test/workspace/modules/Model/target/unwoven-test-classes
[INFO] Executed tasks
[INFO] 
[INFO] --- maven-resources-plugin:3.2.0:resources (default-resources) @ it-tidalwave-bluemarine2-model ---
[INFO] Using 'UTF-8' encoding to copy filtered resources.
[INFO] Using 'UTF-8' encoding to copy filtered properties files.
[INFO] Copying 1 resource
[INFO] 
[INFO] --- maven-compiler-plugin:3.8.1:compile (default-compile) @ it-tidalwave-bluemarine2-model ---
[INFO] Changes detected - recompiling the module!
[INFO] Compiling 45 source files to /var/jenkins_home/jobs/blueMarine2_Build_and_Quick_Test/workspace/modules/Model/target/unwoven-classes
[INFO] -------------------------------------------------------------
[WARNING] COMPILATION WARNING : 
[INFO] -------------------------------------------------------------
[WARNING] No processor claimed any of these annotations: /org.springframework.core.annotation.Order,/javax.annotation.Nullable,/it.tidalwave.messagebus.annotation.ListensTo,/javax.annotation.Nonnegative,/it.tidalwave.dci.annotation.DciRole,/javax.annotation.Nonnull,/it.tidalwave.util.annotation.VisibleForTesting,/it.tidalwave.messagebus.annotation.SimpleMessageSubscriber,/javax.annotation.concurrent.Immutable,java.base/java.lang.Override
[WARNING] /var/jenkins_home/jobs/blueMarine2_Build_and_Quick_Test/workspace/modules/Model/src/main/java/it/tidalwave/bluemarine2/model/MediaItem.java:[85,81] [deprecation] Key(String) in Key has been deprecated
[WARNING] /var/jenkins_home/jobs/blueMarine2_Build_and_Quick_Test/workspace/modules/Model/src/main/java/it/tidalwave/bluemarine2/model/MediaItem.java:[91,81] [deprecation] Key(String) in Key has been deprecated
[WARNING] /var/jenkins_home/jobs/blueMarine2_Build_and_Quick_Test/workspace/modules/Model/src/main/java/it/tidalwave/bluemarine2/model/MediaItem.java:[96,84] [deprecation] Key(String) in Key has been deprecated
[WARNING] /var/jenkins_home/jobs/blueMarine2_Build_and_Quick_Test/workspace/modules/Model/src/main/java/it/tidalwave/bluemarine2/model/MediaItem.java:[98,74] [deprecation] Key(String) in Key has been deprecated
[WARNING] /var/jenkins_home/jobs/blueMarine2_Build_and_Quick_Test/workspace/modules/Model/src/main/java/it/tidalwave/bluemarine2/model/impl/DefaultCacheManager.java:[63,53] [unchecked] unchecked cast
  required: SoftReference<T>
  found:    SoftReference<CAP#1>
  where T is a type-variable:
    T extends Object declared in method <T>getCachedObject(Object,Supplier<T>)
  where CAP#1 is a fresh type-variable:
    CAP#1 extends Object from capture of ?
[WARNING] /var/jenkins_home/jobs/blueMarine2_Build_and_Quick_Test/workspace/modules/Model/src/main/java/it/tidalwave/bluemarine2/model/impl/DefaultMediaFileSystem.java:[81,47] [deprecation] <T>get(Key<T>) in TypeSafeMap has been deprecated
  where T is a type-variable:
    T extends Object declared in method <T>get(Key<T>)
[WARNING] /var/jenkins_home/jobs/blueMarine2_Build_and_Quick_Test/workspace/modules/Model/src/main/java/it/tidalwave/bluemarine2/model/impl/PathAwareMediaFolderDecorator.java:[81,61] [unchecked] unchecked conversion
  required: SimpleComposite<Entity>
  found:    SimpleComposite
[WARNING] /var/jenkins_home/jobs/blueMarine2_Build_and_Quick_Test/workspace/modules/Model/src/main/java/it/tidalwave/bluemarine2/model/impl/PathAwareMediaFolderDecorator.java:[115,29] [unchecked] unchecked method invocation: constructor <init> in class MappingFinder is applied to given types
  required: Finder<TYPE>,Function<TYPE,TYPE>
  found: Finder,Function<Object,Object>
  where TYPE is a type-variable:
    TYPE extends Object declared in class MappingFinder
[WARNING] /var/jenkins_home/jobs/blueMarine2_Build_and_Quick_Test/workspace/modules/Model/src/main/java/it/tidalwave/bluemarine2/model/impl/PathAwareMediaFolderDecorator.java:[115,49] [unchecked] unchecked conversion
  required: Finder<TYPE>
  found:    Finder
  where TYPE is a type-variable:
    TYPE extends Object declared in class MappingFinder
[WARNING] /var/jenkins_home/jobs/blueMarine2_Build_and_Quick_Test/workspace/modules/Model/src/main/java/it/tidalwave/bluemarine2/model/impl/PathAwareMediaFolderDecorator.java:[114,15] [unchecked] unchecked method invocation: constructor <init> in class PathAwareEntityFinderDelegate is applied to given types
  required: MediaFolder,Finder<PathAwareEntity>
  found: MediaFolder,MappingFinder
[WARNING] /var/jenkins_home/jobs/blueMarine2_Build_and_Quick_Test/workspace/modules/Model/src/main/java/it/tidalwave/bluemarine2/model/impl/PathAwareMediaFolderDecorator.java:[115,29] [unchecked] unchecked conversion
  required: Finder<PathAwareEntity>
  found:    MappingFinder
[WARNING] /var/jenkins_home/jobs/blueMarine2_Build_and_Quick_Test/workspace/modules/Model/src/main/java/it/tidalwave/bluemarine2/model/VirtualMediaFolder.java:[124,42] [unchecked] unchecked cast
  required: Optional<PathAwareEntity>
  found:    Object
[WARNING] /var/jenkins_home/jobs/blueMarine2_Build_and_Quick_Test/workspace/modules/Model/src/main/java/it/tidalwave/bluemarine2/model/spi/MetadataSupport.java:[79,82] [unchecked] unchecked cast
  required: T
  found:    Object
  where T is a type-variable:
    T extends Object declared in method <T>get(Key<T>)
[WARNING] /var/jenkins_home/jobs/blueMarine2_Build_and_Quick_Test/workspace/modules/Model/src/main/java/it/tidalwave/bluemarine2/model/spi/MetadataSupport.java:[91,40] [unchecked] unchecked cast
  required: T
  found:    Object
  where T is a type-variable:
    T extends Object declared in method <T>getAll(Key<T>)
[WARNING] /var/jenkins_home/jobs/blueMarine2_Build_and_Quick_Test/workspace/modules/Model/src/main/java/it/tidalwave/bluemarine2/model/spi/MetadataSupport.java:[93,94] [unchecked] unchecked cast
  required: T
  found:    List<Object>
  where T is a type-variable:
    T extends Object declared in method <T>getAll(Key<T>)
[WARNING] /var/jenkins_home/jobs/blueMarine2_Build_and_Quick_Test/workspace/modules/Model/src/main/java/it/tidalwave/bluemarine2/model/impl/AudioMetadataFactory.java:[129,74] [unchecked] unchecked cast
  required: Key<Object>
  found:    Key<CAP#1>
  where CAP#1 is a fresh type-variable:
    CAP#1 extends Object from capture of ?
[WARNING] /var/jenkins_home/jobs/blueMarine2_Build_and_Quick_Test/workspace/modules/Model/src/main/java/it/tidalwave/bluemarine2/model/impl/PathAwareEntityFinderDelegate.java:[152,61] [unchecked] unchecked method invocation: method orElse in class Optional is applied to given types
  required: T
  found: List
  where T is a type-variable:
    T extends Object declared in class Optional
[WARNING] /var/jenkins_home/jobs/blueMarine2_Build_and_Quick_Test/workspace/modules/Model/src/main/java/it/tidalwave/bluemarine2/model/impl/PathAwareEntityFinderDelegate.java:[152,62] [unchecked] unchecked conversion
  required: T
  found:    List
  where T is a type-variable:
    T extends Object declared in class Optional
[WARNING] /var/jenkins_home/jobs/blueMarine2_Build_and_Quick_Test/workspace/modules/Model/src/main/java/it/tidalwave/bluemarine2/model/impl/PathAwareEntityFinderDelegate.java:[151,15] [unchecked] unchecked method invocation: constructor <init> in class CopyOnWriteArrayList is applied to given types
  required: Collection<? extends E>
  found: List
  where E is a type-variable:
    E extends Object declared in class CopyOnWriteArrayList
[WARNING] /var/jenkins_home/jobs/blueMarine2_Build_and_Quick_Test/workspace/modules/Model/src/main/java/it/tidalwave/bluemarine2/model/impl/PathAwareEntityFinderDelegate.java:[152,61] [unchecked] unchecked conversion
  required: Collection<? extends E>
  found:    List
  where E is a type-variable:
    E extends Object declared in class CopyOnWriteArrayList
[WARNING] /var/jenkins_home/jobs/blueMarine2_Build_and_Quick_Test/workspace/modules/Model/src/main/java/it/tidalwave/bluemarine2/model/impl/PathAwareEntityFinderDelegate.java:[151,15] [unchecked] unchecked conversion
  required: List<? extends PathAwareEntity>
  found:    CopyOnWriteArrayList
[WARNING] /var/jenkins_home/jobs/blueMarine2_Build_and_Quick_Test/workspace/modules/Model/src/main/java/it/tidalwave/bluemarine2/model/impl/PathAwareEntityFinderDelegate.java:[207,60] [unchecked] unchecked cast
  required: Optional<PathAwareEntity>
  found:    Optional<CAP#1>
  where CAP#1 is a fresh type-variable:
    CAP#1 extends PathAwareEntity from capture of ? extends PathAwareEntity
[WARNING] /var/jenkins_home/jobs/blueMarine2_Build_and_Quick_Test/workspace/modules/Model/src/main/java/it/tidalwave/bluemarine2/model/impl/PathAwareEntityFinderDelegate.java:[230,19] [rawtypes] found raw type: SimpleComposite
  missing type arguments for generic class SimpleComposite<TYPE>
  where TYPE is a type-variable:
    TYPE extends Object declared in interface SimpleComposite
[INFO] 24 warnings 
[INFO] -------------------------------------------------------------
[INFO] -------------------------------------------------------------
[ERROR] COMPILATION ERROR : 
[INFO] -------------------------------------------------------------
[ERROR] /var/jenkins_home/jobs/blueMarine2_Build_and_Quick_Test/workspace/modules/Model/src/main/java/it/tidalwave/bluemarine2/model/impl/AudioMetadataFactory.java:[86,48] error: unreported exception CannotReadException; must be caught or declared to be thrown
[INFO] 1 error
[INFO] -------------------------------------------------------------
[JENKINS] Archiving disabled
Started calculate disk usage of build
Finished Calculation of disk usage of build in 0 seconds
Started calculate disk usage of workspace
Finished Calculation of disk usage of workspace in 0 seconds
[JENKINS] Archiving disabled
[JENKINS] Archiving disabled
[JENKINS] Archiving disabled
[JENKINS] Archiving disabled
[JENKINS] Archiving disabled
[JENKINS] Archiving disabled
[JENKINS] Archiving disabled
[JENKINS] Archiving disabled
[JENKINS] Archiving disabled
[JENKINS] Archiving disabled
[JENKINS] Archiving disabled
[JENKINS] Archiving disabled
[JENKINS] Archiving disabled
[JENKINS] Archiving disabled
[JENKINS] Archiving disabled
[JENKINS] Archiving disabled
[JENKINS] Archiving disabled
[JENKINS] Archiving disabled
[JENKINS] Archiving disabled
[JENKINS] Archiving disabled
[JENKINS] Archiving disabled
[JENKINS] Archiving disabled
[JENKINS] Archiving disabled
[JENKINS] Archiving disabled
[JENKINS] Archiving disabled
[INFO] ------------------------------------------------------------------------
[INFO] Reactor Summary for blueMarine II 1.1-ALPHA-2-SNAPSHOT:
[INFO] 
[INFO] blueMarine II ...................................... SUCCESS [  2.310 s]
[INFO] blueMarine II (modules) ............................ SUCCESS [  0.510 s]
[INFO] blueMarine II :: Commons ........................... SUCCESS [ 13.409 s]
[INFO] blueMarine II :: Capture One 11 Applescript ........ SUCCESS [ 11.309 s]
[INFO] blueMarine II :: Commons for Tests ................. SUCCESS [  5.979 s]
[INFO] blueMarine II :: Model ............................. FAILURE [  9.305 s]
[INFO] blueMarine II :: Persistence ....................... SKIPPED
[INFO] blueMarine II :: Vocabulary ........................ SKIPPED
[INFO] blueMarine II :: MusicBrainz :: Data Model ......... SKIPPED
[INFO] blueMarine II :: MusicBrainz ....................... SKIPPED
[INFO] blueMarine II :: Media Scanner ..................... SKIPPED
[INFO] blueMarine II :: Catalog ........................... SKIPPED
[INFO] blueMarine II :: Downloader ........................ SKIPPED
[INFO] blueMarine II :: UI ................................ SKIPPED
[INFO] blueMarine II :: UI :: JavaFX ...................... SKIPPED
[INFO] blueMarine II :: CEC :: Adapter .................... SKIPPED
[INFO] blueMarine II :: CEC :: Navigation Adapter ......... SKIPPED
[INFO] blueMarine II :: Media Server ...................... SKIPPED
[INFO] blueMarine II :: Media Server :: REST .............. SKIPPED
[INFO] blueMarine II :: Media Server :: UPnP .............. SKIPPED
[INFO] blueMarine II :: Initializer ....................... SKIPPED
[INFO] blueMarine II :: Services (modules) ................ SKIPPED
[INFO] blueMarine II :: Services :: StoppingDown .......... SKIPPED
[INFO] blueMarine II :: Headless Service .................. SKIPPED
[INFO] blueMarine II :: Application :: JavaFX ............. SKIPPED
[INFO] blueMarine II :: Plugins (modules) ................. SKIPPED
[INFO] ------------------------------------------------------------------------
[INFO] BUILD FAILURE
[INFO] ------------------------------------------------------------------------
[INFO] Total time:  50.823 s
[JENKINS] Archiving disabled
[INFO] Finished at: 2021-12-22T08:54:58Z
[INFO] ------------------------------------------------------------------------
[ERROR] Failed to execute goal org.apache.maven.plugins:maven-compiler-plugin:3.8.1:compile (default-compile) on project it-tidalwave-bluemarine2-model: Compilation failure
[ERROR] /var/jenkins_home/jobs/blueMarine2_Build_and_Quick_Test/workspace/modules/Model/src/main/java/it/tidalwave/bluemarine2/model/impl/AudioMetadataFactory.java:[86,48] error: unreported exception CannotReadException; must be caught or declared to be thrown
[ERROR] -> [Help 1]
[ERROR] 
[ERROR] To see the full stack trace of the errors, re-run Maven with the -e switch.
[ERROR] Re-run Maven using the -X switch to enable full debug logging.
[ERROR] 
[ERROR] For more information about the errors and possible solutions, please read the following articles:
[ERROR] [Help 1] http://cwiki.apache.org/confluence/display/MAVEN/MojoFailureException
[ERROR] 
[ERROR] After correcting the problems, you can resume the build with the command
[ERROR]   mvn <goals> -rf :it-tidalwave-bluemarine2-model
channel stopped
Build step 'Dependency analysis' marked build as failure
TestNG Reports Processing: START
Looking for TestNG results report in workspace using pattern: **/target/**/testng-results.xml
Saving reports...
Processing '/var/jenkins_home/jobs/blueMarine2_Build_and_Quick_Test/builds/158/testng/testng-results-1.xml'
Processing '/var/jenkins_home/jobs/blueMarine2_Build_and_Quick_Test/builds/158/testng/testng-results.xml'
TestNG Reports Processing: FINISH
[description-setter] Description set: 
Started calculate disk usage of build
Finished Calculation of disk usage of build in 0 seconds
Started calculate disk usage of workspace
Finished Calculation of disk usage of workspace in 0 seconds
Finished: FAILURE